Diacenaphtho[1,2-j:1',2'-l]fluoranthene
- Formula: C36H18
- Molecular weight: 450.5281
- IUPAC Standard InChIKey: CUIWZLHUNCCYBL-UHFFFAOYSA-N
- CAS Registry Number: 191-48-0
- Chemical structure:
View 3d structure (requires JavaScript / HTML 5) - Other names: Decacyclene; Diacenaphtheno[1,2-j:1',2'-l]fluoranthen; tri-Perinaphthylene benzene; benzo[a,a',a']triacenaphthylene

Phase change data

Data compiled as indicated in comments:
TRC - Thermodynamics Research Center, NIST Boulder Laboratories, Chris Muzny director
DH - Eugene S. Domalski and Elizabeth D. Hearing
AC - William E. Acree, Jr., James S. Chickos
Quantity | Value | Units | Method | Reference | Comment |
---|---|---|---|---|---|
Tfus | 666. | K | N/A | Smith, 1980 | Uncertainty assigned by TRC = 1. K; TRC |
Tfus | 562.0 | K | N/A | Farrell and Shahidi, 1979 | Crystal phase 1 phase; Uncertainty assigned by TRC = 0.3 K; TRC |
Enthalpy of fusion
ΔfusH (kJ/mol) | Temperature (K) | Reference | Comment |
---|---|---|---|
45.200 | 562.0 | Farrell, Shahidi, et al., 1979 | DH |
25.4 | 666. | Smith, 1980, 2 | AC |
Entropy of fusion
ΔfusS (J/mol*K) | Temperature (K) | Reference | Comment |
---|---|---|---|
80.4 | 562.0 | Farrell, Shahidi, et al., 1979 | DH |
Temperature of phase transition
Ttrs (K) | Initial Phase | Final Phase | Reference | Comment |
---|---|---|---|---|
533. | crystaline, II | crystaline, I | Farrell, Shahidi, et al., 1979 | DH |

Gas phase ion energetics data

Data compiled by: Henry M. Rosenstock, Keith Draxl, Bruce W. Steiner, and John T. Herron
Ionization energy determinations
IE (eV) | Method | Reference |
---|---|---|
7.3 ± 0.1 | EI | Gallegos, 1968 |

References

Smith, 1980
Smith, G.W.,
Phase behavior of some condensed polycyclic aromatics,
Mol. Cryst. Liq. Cryst., 1980, 64, 15. [all data]
Farrell and Shahidi, 1979
Farrell, P.G.; Shahidi, F.,
DSC studies of aromatic hydrocarbon picrates,
Thermochim. Acta, 1979, 33, 275. [all data]
Farrell, Shahidi, et al., 1979
Farrell, P.G.; Shahidi, F.; Casellato, F.; Vecchi, C.; Girelli, A.,
DSC studies of aromatic hydrocarbon picrates,
Thermochim. Acta, 1979, 33, 275-280. [all data]
Smith, 1980, 2
Smith, George W.,
Phase Behavior of some Condensed Polycyclic Aromatics,
Molecular Crystals and Liquid Crystals, 1980, 64, 1, 15-17, https://doi.org/10.1080/01406568008072649
. [all data]
Gallegos, 1968
Gallegos, E.J.,
Mass spectrometry and ionization energies of some condensed-ring aromatic and heterocyclic compounds,
J. Phys. Chem., 1968, 72, 3452. [all data]