1,2,9,10-Dibenzopyrene
- Formula: C24H14
- Molecular weight: 302.3680
- IUPAC Standard InChIKey: JNTHRSHGARDABO-UHFFFAOYSA-N
- CAS Registry Number: 191-30-0
- Chemical structure:
View 3d structure (requires JavaScript / HTML 5) - Other names: Dibenzo[def,p]chrysene; 1,2:3,4-Dibenzopyrene; Ba 51-090462; Dibenzo[a,l]pyrene; 1,2:9,10-Dibenzopyrene; 4,5:6,7-Dibenzpyrene; Db(a,l)p; Dibenzo(a,d)pyrene; 4,5,6,7-Dibenzpyrene; 2,3:4,5-Dibenzopyrene; Dibenz[a,l]pyrene; NSC 90324; 1,2,4,5-Dibenzpyrene; 1,2,3,4-Dibenzpyrene; Dibenzo(a,1)pyrene; 1,2:9,1o-Dibenzopyrene

Phase change data

Data compiled as indicated in comments:
TRC - Thermodynamics Research Center, NIST Boulder Laboratories, Chris Muzny director
AC - William E. Acree, Jr., James S. Chickos
Quantity | Value | Units | Method | Reference | Comment |
---|---|---|---|---|---|
Tfus | 501.2 | K | N/A | Casellato, Vecchi, et al., 1973 | Uncertainty assigned by TRC = 0.4 K; TRC |
Enthalpy of fusion
ΔfusH (kJ/mol) | Temperature (K) | Reference | Comment |
---|---|---|---|
24.68 | 501.2 | Acree, 1991 | AC |

Gas phase ion energetics data

Data compiled by: Henry M. Rosenstock, Keith Draxl, Bruce W. Steiner, and John T. Herron
Ionization energy determinations
IE (eV) | Method | Reference |
---|---|---|
7.27 | CTS | Briegleb, 1964 |
7.03 | CTS | Matsen, 1956 |

Kovats' RI, non-polar column, isothermal

Column type | Active phase | Temperature (C) | I | Reference | Comment |
---|---|---|---|---|---|
Capillary | OV-101 | 270. | 3423. | Grimmer and Böhnke, 1972 | N2; Column length: 50. m; Column diameter: 0.50 mm |

Lee's RI, non-polar column, temperature ramp

Column type | Active phase | I | Reference | Comment |
---|---|---|---|---|
Capillary | HP-5 | 553. | Marynowski, Pieta, et al., 2004 | 60. m/0.25 mm/0.25 μm, He, 3. K/min; Tstart: 35. C; Tend: 300. C |
Capillary | DB-5MS | 541.9 | Sauvain and Duc, 2004 | 30. m/0.25 mm/0.25 μm, 60. C @ 3. min, 5. K/min, 320. C @ 20. min |
Capillary | DB-5MS | 540.01 | Chen, Keeran, et al., 2002 | 30. m/0.25 mm/0.5 μm, 40. C @ 1. min, 4. K/min; Tend: 310. C |

Lee's RI, non-polar column, custom temperature program

Column type | Active phase | I | Reference | Comment |
---|---|---|---|---|
Capillary | 5 % Phenyl methyl siloxane | 538.21 | Allen J.O., Durant J.L., et al., 1998 | Program: not specified |

References

Casellato, Vecchi, et al., 1973
Casellato, F.; Vecchi, C.; Girell, A.,
Differential calorimetric study of polycyclic aromatic hydrocarbons,
Thermochim. Acta, 1973, 6, 4, 361, https://doi.org/10.1016/0040-6031(73)87003-0
. [all data]
Acree, 1991
Acree, William E.,
Thermodynamic properties of organic compounds: enthalpy of fusion and melting point temperature compilation,
Thermochimica Acta, 1991, 189, 1, 37-56, https://doi.org/10.1016/0040-6031(91)87098-H
. [all data]
Briegleb, 1964
Briegleb, G.,
Electron affinity of organic molecules,
Angew. Chem. Intern. Ed., 1964, 3, 617. [all data]
Matsen, 1956
Matsen, F.A.,
Electron affinities, methyl affinities, and ionization energies of condensed ring aromatic hydrocarbons,
J. Chem. Phys., 1956, 24, 602. [all data]