Benzo[ghi]perylene
- Formula: C22H12
- Molecular weight: 276.3307
- IUPAC Standard InChIKey: GYFAGKUZYNFMBN-UHFFFAOYSA-N
- CAS Registry Number: 191-24-2
- Chemical structure:
View 3d structure (requires JavaScript / HTML 5) - Other names: Benzo-1,12-perylene; 1,12-Benzoperylene; 1,12-Benzperylene

Gas phase thermochemistry data

Data compiled by: Glushko Thermocenter, Russian Academy of Sciences, Moscow
Constant pressure heat capacity of gas
Cp,gas (J/mol*K) | Temperature (K) | Reference | Comment |
---|---|---|---|
47.36 | 50. | Dorofeeva O.V., 1988 | Recommended values were calculated statistically mechanically using force field approximation for polycyclic aromatic hydrocarbons to estimate the needed vibrational frequencies (see also [ Dorofeeva O.V., 1986, Moiseeva N.F., 1989]). These functions are reproduced in the reference book [ Frenkel M., 1994]. |
80.71 | 100. | ||
123.88 | 150. | ||
172.19 | 200. | ||
246.03 | 273.15 | ||
271.0 ± 4.0 | 298.15 | ||
272.83 | 300. | ||
365.55 | 400. | ||
442.58 | 500. | ||
504.03 | 600. | ||
552.90 | 700. | ||
592.19 | 800. | ||
624.23 | 900. | ||
650.67 | 1000. | ||
672.72 | 1100. | ||
691.24 | 1200. | ||
706.92 | 1300. | ||
720.28 | 1400. | ||
731.73 | 1500. |

Phase change data

Data compiled as indicated in comments:
TRC - Thermodynamics Research Center, NIST Boulder Laboratories, Chris Muzny director
AC - William E. Acree, Jr., James S. Chickos
ALS - Hussein Y. Afeefy, Joel F. Liebman, and Stephen E. Stein
Quantity | Value | Units | Method | Reference | Comment |
---|---|---|---|---|---|
Tfus | 553.0 | K | N/A | Smith, 1980 | Uncertainty assigned by TRC = 0.2 K; TRC |
Tfus | 554.2 | K | N/A | Casellato, Vecchi, et al., 1973 | Uncertainty assigned by TRC = 0.4 K; TRC |
Quantity | Value | Units | Method | Reference | Comment |
ΔvapH° | 128.9 ± 1.5 | kJ/mol | CGC | Hanshaw, Nutt, et al., 2008 | AC |
Quantity | Value | Units | Method | Reference | Comment |
ΔsubH° | 126. | kJ/mol | V | Wakayama and Inokuchi, 1967 | ALS |
Enthalpy of vaporization
ΔvapH (kJ/mol) | Temperature (K) | Method | Reference | Comment |
---|---|---|---|---|
96.1 | 398. | GC | Lei, Chankalal, et al., 2002 | Based on data from 323. to 473. K.; AC |
Enthalpy of sublimation
ΔsubH (kJ/mol) | Temperature (K) | Method | Reference | Comment |
---|---|---|---|---|
129.9 | 383. | GS | Nass, Lenoir, et al., 1995 | Based on data from 313. to 453. K.; AC |
127.8 | 404. | ME | Stephenson and Malanowski, 1987 | Based on data from 389. to 468. K. See also Murray, Pottie, et al., 1974.; AC |
135.1 | 465. | A | Stephenson and Malanowski, 1987 | Based on data from 450. to 510. K.; AC |
125.5 | 478. | ME | Wakayama and Inokuchi, 1967, 2 | Based on data from 454. to 502. K.; AC |
Enthalpy of fusion
ΔfusH (kJ/mol) | Temperature (K) | Reference | Comment |
---|---|---|---|
17.37 | 554.2 | Acree, 1991 | AC |

Gas phase ion energetics data

Data evaluated as indicated in comments:
HL - Edward P. Hunter and Sharon G. Lias
L - Sharon G. Lias
Data compiled as indicated in comments:
MM - Michael M. Meot-Ner (Mautner)
LLK - Sharon G. Lias, Rhoda D. Levin, and Sherif A. Kafafi
RDSH - Henry M. Rosenstock, Keith Draxl, Bruce W. Steiner, and John T. Herron
B - John E. Bartmess
Quantity | Value | Units | Method | Reference | Comment |
---|---|---|---|---|---|
IE (evaluated) | 7.17 ± 0.02 | eV | N/A | N/A | L |
Quantity | Value | Units | Method | Reference | Comment |
Proton affinity (review) | 876.0 | kJ/mol | N/A | Hunter and Lias, 1998 | HL |
Quantity | Value | Units | Method | Reference | Comment |
Gas basicity | 845.2 | kJ/mol | N/A | Hunter and Lias, 1998 | HL |
Electron affinity determinations
EA (eV) | Method | Reference | Comment |
---|---|---|---|
0.42 ± 0.10 | CIDC | Chen and Cooks, 1995 | B |
Proton affinity at 298K
Proton affinity (kJ/mol) | Reference | Comment |
---|---|---|
877.8 | Aue, Guidoni, et al., 2000 | Experimental literature data re-evaluated by the authors using ab initio protonation entropies; MM |
Gas basicity at 298K
Gas basicity (review) (kJ/mol) | Reference | Comment |
---|---|---|
850.6 | Aue, Guidoni, et al., 2000 | Experimental literature data re-evaluated by the authors using ab initio protonation entropies; MM |
Ionization energy determinations
IE (eV) | Method | Reference | Comment |
---|---|---|---|
7.20 ± 0.05 | EQ | Mautner(Meot-Ner), 1980 | LLK |
7.15 | PE | Clar and Schmidt, 1977 | LLK |
7.19 ± 0.01 | PE | Boschi, Murrell, et al., 1972 | LLK |
7.35 | CTS | Briegleb, 1964 | RDSH |
7.13 | CTS | Matsen, 1956 | RDSH |
7.15 | PE | Clar and Schmidt, 1977 | Vertical value; LLK |
7.15 | PE | Clar and Schmidt, 1976 | Vertical value; LLK |

Ion clustering data

Data compiled by: Michael M. Meot-Ner (Mautner) and Sharon G. Lias
Clustering reactions
By formula: C22H12+ + C22H12 = (C22H12+ • C22H12)
Bond type: Charge transfer bond (positive ion)
Quantity | Value | Units | Method | Reference | Comment |
---|---|---|---|---|---|
ΔrH° | 90.4 | kJ/mol | PHPMS | Meot-Ner (Mautner), 1980 | gas phase |
Quantity | Value | Units | Method | Reference | Comment |
ΔrS° | 110. | J/mol*K | PHPMS | Meot-Ner (Mautner), 1980 | gas phase |
By formula: C22H13+ + C22H12 = (C22H13+ • C22H12)
Quantity | Value | Units | Method | Reference | Comment |
---|---|---|---|---|---|
ΔrH° | 89.5 | kJ/mol | PHPMS | Meot-Ner (Mautner), 1980 | gas phase; Entropy change calculated or estimated |
Quantity | Value | Units | Method | Reference | Comment |
ΔrS° | 120. | J/mol*K | N/A | Meot-Ner (Mautner), 1980 | gas phase; Entropy change calculated or estimated |
Free energy of reaction
ΔrG° (kJ/mol) | T (K) | Method | Reference | Comment |
---|---|---|---|---|
44.4 | 385. | PHPMS | Meot-Ner (Mautner), 1980 | gas phase; Entropy change calculated or estimated |

Reaction thermochemistry data

Data compiled by: Michael M. Meot-Ner (Mautner) and Sharon G. Lias
Individual Reactions
By formula: C22H13+ + C22H12 = (C22H13+ • C22H12)
Quantity | Value | Units | Method | Reference | Comment |
---|---|---|---|---|---|
ΔrH° | 21.4 | kcal/mol | PHPMS | Meot-Ner (Mautner), 1980 | gas phase; Entropy change calculated or estimated |
Quantity | Value | Units | Method | Reference | Comment |
ΔrS° | 28. | cal/mol*K | N/A | Meot-Ner (Mautner), 1980 | gas phase; Entropy change calculated or estimated |
Free energy of reaction
ΔrG° (kcal/mol) | T (K) | Method | Reference | Comment |
---|---|---|---|---|
10.6 | 385. | PHPMS | Meot-Ner (Mautner), 1980 | gas phase; Entropy change calculated or estimated |
By formula: C22H12+ + C22H12 = (C22H12+ • C22H12)
Bond type: Charge transfer bond (positive ion)
Quantity | Value | Units | Method | Reference | Comment |
---|---|---|---|---|---|
ΔrH° | 21.6 | kcal/mol | PHPMS | Meot-Ner (Mautner), 1980 | gas phase |
Quantity | Value | Units | Method | Reference | Comment |
ΔrS° | 27. | cal/mol*K | PHPMS | Meot-Ner (Mautner), 1980 | gas phase |

Kovats' RI, non-polar column, isothermal

Column type | Active phase | Temperature (C) | I | Reference | Comment |
---|---|---|---|---|---|
Capillary | SE-30 | 260. | 3115. | Pozhidaev, Berezkin, et al., 1988 | He; Column length: 17.5 m; Column diameter: 0.21 mm |
Capillary | SE-30 | 260. | 3122. | Pozhidaev, Berezkin, et al., 1988 | He; Column length: 17.5 m; Column diameter: 0.21 mm |
Capillary | SE-30 | 260. | 3124. | Pozhidaev, Berezkin, et al., 1988 | He; Column length: 17.5 m; Column diameter: 0.21 mm |
Capillary | SE-30 | 260. | 3137. | Pozhidaev, Berezkin, et al., 1988 | He; Column length: 17.5 m; Column diameter: 0.21 mm |
Capillary | SE-52 | 240. | 3150.1 | Pozhidaev, Berezkin, et al., 1988 | He; Column length: 17.5 m; Column diameter: 0.21 mm |
Capillary | SE-52 | 240. | 3168.4 | Pozhidaev, Berezkin, et al., 1988 | He; Column length: 17.5 m; Column diameter: 0.21 mm |
Packed | OV-101 | 270. | 3185. | Grimmer and Böhnke, 1976 | N2, Gas Chrom Q (100-120 mesh); Column length: 10. m |
Packed | OV-101 | 270. | 3185. | Grimmer and Böhnke, 1975 | Gas Chrom Q; Column length: 10. m |
Capillary | OV-101 | 270. | 3124. | Grimmer and Böhnke, 1972 | N2; Column length: 50. m; Column diameter: 0.50 mm |

Van Den Dool and Kratz RI, non-polar column, temperature ramp

Column type | Active phase | I | Reference | Comment |
---|---|---|---|---|
Capillary | SE-52 | 3146. | Beernaert, 1979 | He, 50. C @ 5. min, 6. K/min; Column length: 33.3 m; Column diameter: 0.50 mm; Tend: 320. C |
Capillary | SE-52 | 3150. | Carugno and Rossi, 1967 | N2, 1.8 K/min; Column length: 65. m; Column diameter: 0.3 mm; Tstart: 100. C; Tend: 300. C |

Van Den Dool and Kratz RI, non-polar column, custom temperature program

Column type | Active phase | I | Reference | Comment |
---|---|---|---|---|
Capillary | OV-101 | 3144. | Yasuhara, Shiraishi, et al., 1997 | 15. m/0.25 mm/0.25 μm, He; Program: 50C(2min) => (20C/min) => 120C => (7C/min) => 310C(10min) |
Capillary | Methyl Silicone | 3124. | Oda, Ichikawa, et al., 1996 | Program: 50C (2min) => 20C/min => 160C => 5C/min => 210C => 10C/min => 300C |

Normal alkane RI, non-polar column, isothermal

Column type | Active phase | Temperature (C) | I | Reference | Comment |
---|---|---|---|---|---|
Capillary | SE-52 | 240. | 3131.8 | Pozhidaev, Berezkin, et al., 1988 | He; Column length: 17.5 m; Column diameter: 0.21 mm |

Normal alkane RI, non-polar column, temperature ramp

Column type | Active phase | I | Reference | Comment |
---|---|---|---|---|
Capillary | C103H208 | 3160. | Dumitrescu, Buda, et al., 2000 | H2, 5. K/min; Phase thickness: 0.25 μm; Tstart: 80. C; Tend: 275. C |
Capillary | C103H208 | 3149. | Dumitrescu, Buda, et al., 2000 | H2, 4. K/min; Phase thickness: 0.25 μm; Tstart: 100. C; Tend: 275. C |

Normal alkane RI, non-polar column, custom temperature program

Column type | Active phase | I | Reference | Comment |
---|---|---|---|---|
Capillary | Methyl Silicone | 3144. | Oda, Yasuhara, et al., 1998 | 25. m/0.25 mm/0.25 μm, He; Program: 50 0C (2 min) 20 0C/min -> 160 0C 5 0C/min -> 210 0C 10 0C/min -> 300 0C |
Packed | OV-101 | 3185. | Kaliszan and Lamparczyk, 1978 | Program: not specified |

Lee's RI, non-polar column, temperature ramp

Column type | Active phase | I | Reference | Comment |
---|---|---|---|---|
Capillary | 5 % Phenyl methyl siloxane | 501.32 | Skrbic and Onjia, 2006 | 2. K/min; Tstart: 50. C; Tend: 250. C |
Capillary | 5 % Phenyl methyl siloxane | 502.90 | Skrbic and Onjia, 2006 | 80. C @ 2. min, 8. K/min, 300. C @ 10. min |
Capillary | HP-5 | 501.32 | Pedersen, Durant, et al., 2005 | 30. m/0.25 mm/0.25 μm, Helium, 50. C @ 1.5 min, 6. K/min, 310. C @ 10. min |
Capillary | HP-5 | 501.38 | Marynowski, Pieta, et al., 2004 | 60. m/0.25 mm/0.25 μm, He, 3. K/min; Tstart: 35. C; Tend: 300. C |
Capillary | DB-5MS | 502.6 | Sauvain and Duc, 2004 | 30. m/0.25 mm/0.25 μm, 60. C @ 3. min, 5. K/min, 320. C @ 20. min |
Capillary | DB-5MS | 500.00 | Chen, Keeran, et al., 2002 | 30. m/0.25 mm/0.5 μm, 40. C @ 1. min, 4. K/min; Tend: 310. C |
Capillary | PTE-5 | 501.32 | Wang, Jia, et al., 2000 | 30. m/0.25 mm/0.25 μm, 60. C @ 1.5 min, 8. K/min, 300. C @ 12.5 min |
Capillary | HP-5 | 500. | Piao, Chu, et al., 1999 | 30. m/0.25 mm/0.25 μm, 50. C @ 2. min, 4. K/min, 280. C @ 20. min |
Capillary | HP-5 | 500. | Piao, Chu, et al., 1999 | 30. m/0.25 mm/0.25 μm, 50. C @ 2. min, 4. K/min, 280. C @ 20. min |
Capillary | SE-54 | 501.92 | Chen, 1996 | 4. K/min; Column length: 30. m; Column diameter: 0.25 mm; Tstart: 50. C; Tend: 300. C |
Capillary | SE-52 | 500.29 | Shaogang and Xiaobai, 1994 | 40. C @ 2. min, 4. K/min, 300. C @ 20. min; Column length: 30. m; Column diameter: 0.25 mm |
Capillary | DB-5 | 500. | Donnelly, Abdel-Hamid, et al., 1993 | 30. m/0.32 mm/0.25 μm, He, 40. C @ 3. min, 8. K/min, 285. C @ 29.5 min |
Capillary | SE-54 | 502.84 | Guillén, Blanco, et al., 1989 | 20. m/0.22 mm/0.20 μm, He, 4. K/min; Tstart: 50. C; Tend: 300. C |
Capillary | SE-52 | 501.35 | Hasegawa, Muragishi, et al., 1988 | 3. K/min; Column length: 25. m; Column diameter: 0.25 mm; Tstart: 130. C; Tend: 260. C |
Capillary | DB-5 | 500. | Sye, Lin, et al., 1988 | 30. m/0.32 mm/0.25 μm, 80. C @ 1. min, 3. K/min; Tend: 290. C |
Capillary | DB-5 | 501.38 | Wise, Benner, et al., 1988 | 30. m/0.25 mm/0.25 μm, 40. C @ 2. min, 4. K/min, 280. C @ 5. min |
Capillary | DB-5 | 500. | Rostad and Pereira, 1986 | 30. m/0.26 mm/0.25 μm, He, 50. C @ 4. min, 6. K/min, 300. C @ 20. min |
Capillary | DB-5 | 501.59 | Tong, Centen, et al., 1985 | He, 4. K/min; Column length: 30. m; Column diameter: 0.25 mm; Tstart: 90. C; Tend: 325. C |
Capillary | SE-52 | 500.29 | Vassilaros, Kong, et al., 1982 | 20. m/0.30 mm/0.25 μm, H2, 40. C @ 2. min, 4. K/min; Tend: 265. C |
Capillary | SE-52 | 501.32 | Lee, Vassilaros, et al., 1979 | 12. m/0.3 mm/0.34 μm, He, 2. K/min; Tstart: 50. C; Tend: 250. C |

Lee's RI, non-polar column, custom temperature program

Column type | Active phase | I | Reference | Comment |
---|---|---|---|---|
Capillary | DB-5 | 498.9 | Fuentes, Font, et al., 2007 | Column length: 60. m; Program: not specified |
Capillary | HP-5MS | 501.64 | Wang, Li, et al., 2007 | 30. m/0.25 mm/0.25 μm, He; Program: 60C(2min) => 6C/min => 258C => 2C/min => 300C(4min) |
Capillary | HP-5MS | 501.32 | Wang, Li, et al., 2007, 2 | 30. m/0.25 mm/0.25 μm, He; Program: not specified |
Capillary | HP-5MS | 501.38 | Wang, Li, et al., 2007, 2 | 30. m/0.25 mm/0.25 μm, He; Program: not specified |
Capillary | HP-5MS | 501.64 | Wang, Li, et al., 2007, 2 | 30. m/0.25 mm/0.25 μm, He; Program: not specified |
Capillary | 5 % Phenyl methyl siloxane | 501.30 | Skrbic and Onjia, 2006 | Program: 70 0C (2 min) 30 0C/min -> 150 0C 5 0C/min -> 200 0C 4 0C/min -> 310 0C (5 min) |
Capillary | DB-5MS | 500. | Aracil, Font, et al., 2005 | Column length: 60. m; Column diameter: 0.25 mm; Program: not specified |
Capillary | LM-5 | 499.61 | Ré-Poppi and Santiago-Silva, 2005 | 30. m/0.25 mm/0.25 μm, He; Program: 60C(2min) => 15C/min => 180C => 5C/min => 280C (10min) |
Capillary | LM-5 | 500.29 | Ré-Poppi and Santiago-Silva, 2005 | 30. m/0.25 mm/0.25 μm, He; Program: 60C(2min) => 15C/min => 180C => 5C/min => 280C (10min) |
Capillary | Ultra-1 | 501.3 | Sremac, Skrbic, et al., 2005 | 50. m/0.32 mm/0.50 μm, Nitrogen; Program: 40-100 0C 3-15 0C/min -> 290 0C |
Capillary | Ultra-1 | 501.3 | Sremac, Skrbic, et al., 2005 | 50. m/0.32 mm/0.50 μm, Nitrogen; Program: 40-100 0C 3-15 0C/min -> 290 0C |
Capillary | Ultra-1 | 502.9 | Sremac, Skrbic, et al., 2005 | 50. m/0.32 mm/0.50 μm, Nitrogen; Program: 40-100 0C 3-15 0C/min -> 290 0C |
Capillary | DB-5 | 502.9 | Lundstedt, Haglund, et al., 2003 | 30. m/0.25 mm/0.25 μm; Program: not specified |
Capillary | LM-5 | 500.20 | Ré-Poppi and Santiago-Silva, 2002 | 30. m/0.25 mm/0.25 μm, He; Program: 60C(2min) => 15C/min => 180C => 5C/min => 280C(5min) |
Capillary | LM-5 | 500.29 | Ré-Poppi and Santiago-Silva, 2002 | 30. m/0.25 mm/0.25 μm, He; Program: 60C(2min) => 15C/min => 180C => 5C/min => 280C(5min) |
Capillary | DB-5 | 500.29 | Zamperlini, Silva, et al., 1997 | 30. m/0.25 mm/0.25 μm, He; Program: 90C (1min) => 10C/min => 120C => 4C/min => 310C (20min) |
Capillary | DB-5 | 501.88 | Zamperlini, Silva, et al., 1997 | 30. m/0.25 mm/0.25 μm, He; Program: 90C (1min) => 10C/min => 120C => 4C/min => 310C (20min) |
Capillary | SE-54 | 501.32 | Chen, 1996 | Column length: 30. m; Column diameter: 0.25 mm; Program: not specified |
Capillary | SE-52 | 500.29 | Shaogang and Xiaobai, 1994 | Column length: 30. m; Column diameter: 0.25 mm; Program: not specified |
Capillary | SE-54 | 501.90 | Guillen, Iglesias, et al., 1992 | Program: not specified |
Capillary | DB-5 | 501.32 | Takada, Onda, et al., 1990 | He; Program: 70C(2min) => 30C/min => 150C => 5C/min => 200C => 4C/min => 310C |
Capillary | DB-5 | 499.69 | Naikwadi, Charbonneau, et al., 1987 | Column length: 30. m; Column diameter: 0.32 mm; Program: not specified |
Capillary | DB-5 | 500. | Naikwadi, Charbonneau, et al., 1987 | Column length: 30. m; Column diameter: 0.32 mm; Program: not specified |
Capillary | OV-101 | 502.8 | Tucminen, Wickstrom, et al., 1986 | Program: not specified |
Capillary | DB-5 | 501.32 | Tong, Centen, et al., 1985 | He; Column length: 30. m; Column diameter: 0.25 mm; Program: not specified |
Capillary | SE-52 | 526.92 | Shlyakhov, 1984 | Program: not specified |
Capillary | SE-52 | 501.01 | Shlyakhov, 1984 | Program: not specified |
Capillary | SE-52 | 501.32 | Shlyakhov, 1984 | Program: not specified |

Henry's Law data

Data compiled by: Rolf Sander
Henry's Law constant (water solution)
kH(T) = k°H exp(d(ln(kH))/d(1/T) ((1/T) - 1/(298.15 K)))
k°H = Henry's law constant for solubility in water at 298.15 K (mol/(kg*bar))
d(ln(kH))/d(1/T) = Temperature dependence constant (K)
k°H (mol/(kg*bar)) | d(ln(kH))/d(1/T) (K) | Method | Reference |
---|---|---|---|
3000. | 3200. | X | N/A |

References

Dorofeeva O.V., 1988
Dorofeeva O.V.,
Thermodynamic Properties of Polycyclic Aromatic Hydrocarbons in the Gaseous Phase. Institute for High Temperatures, USSR Academy of Sciences, Preprint No.1-238 (in Russian), Moscow, 1988. [all data]
Dorofeeva O.V., 1986
Dorofeeva O.V.,
On calculation of thermodynamic properties of polycyclic aromatic hydrocarbons,
Thermochim. Acta, 1986, 102, 59-66. [all data]
Moiseeva N.F., 1989
Moiseeva N.F.,
Development of Benson group additivity method for estimation of ideal gas thermodynamic properties of polycyclic aromatic hydrocarbons,
Thermochim. Acta, 1989, 153, 77-85. [all data]
Frenkel M., 1994
Frenkel M.,
Thermodynamics of Organic Compounds in the Gas State, Vol. I, II, Thermodynamics Research Center, College Station, Texas, 1994, 1994. [all data]
Smith, 1980
Smith, G.W.,
Phase behavior of some condensed polycyclic aromatics,
Mol. Cryst. Liq. Cryst., 1980, 64, 15. [all data]
Casellato, Vecchi, et al., 1973
Casellato, F.; Vecchi, C.; Girell, A.,
Differential calorimetric study of polycyclic aromatic hydrocarbons,
Thermochim. Acta, 1973, 6, 4, 361, https://doi.org/10.1016/0040-6031(73)87003-0
. [all data]
Hanshaw, Nutt, et al., 2008
Hanshaw, William; Nutt, Marjorie; Chickos, James S.,
Hypothetical Thermodynamic Properties. Subcooled Vaporization Enthalpies and Vapor Pressures of Polyaromatic Hydrocarbons,
J. Chem. Eng. Data, 2008, 53, 8, 1903-1913, https://doi.org/10.1021/je800300x
. [all data]
Wakayama and Inokuchi, 1967
Wakayama, N.; Inokuchi, H.,
Heats of sublimation of polycyclic aromatic hydrocarbons and their molecular packings,
Bull. Chem. Soc. Jpn., 1967, 40, 2267. [all data]
Lei, Chankalal, et al., 2002
Lei, Ying Duan; Chankalal, Raymond; Chan, Anita; Wania, Frank,
Supercooled Liquid Vapor Pressures of the Polycyclic Aromatic Hydrocarbons,
J. Chem. Eng. Data, 2002, 47, 4, 801-806, https://doi.org/10.1021/je0155148
. [all data]
Nass, Lenoir, et al., 1995
Nass, Karen; Lenoir, Dieter; Kettrup, Antonius,
Calculation of the Thermodynamic Properties of Polycyclic Aromatic Hydrocarbons by an Incremental Procedure,
Angew. Chem. Int. Ed. Engl., 1995, 34, 16, 1735-1736, https://doi.org/10.1002/anie.199517351
. [all data]
Stephenson and Malanowski, 1987
Stephenson, Richard M.; Malanowski, Stanislaw,
Handbook of the Thermodynamics of Organic Compounds, 1987, https://doi.org/10.1007/978-94-009-3173-2
. [all data]
Murray, Pottie, et al., 1974
Murray, John James; Pottie, Roswell Francis; Pupp, Christian,
The Vapor Pressures and Enthalpies of Sublimation of Five Polycyclic Aromatic Hydrocarbons,
Can. J. Chem., 1974, 52, 4, 557-563, https://doi.org/10.1139/v74-087
. [all data]
Wakayama and Inokuchi, 1967, 2
Wakayama, Nobuko; Inokuchi, Hiroo,
Heats of Sublimation of Polycyclic Aromatic Hydrocarbons and Their Molecular Packings,
Bull. Chem. Soc. Jpn., 1967, 40, 10, 2267-2271, https://doi.org/10.1246/bcsj.40.2267
. [all data]
Acree, 1991
Acree, William E.,
Thermodynamic properties of organic compounds: enthalpy of fusion and melting point temperature compilation,
Thermochimica Acta, 1991, 189, 1, 37-56, https://doi.org/10.1016/0040-6031(91)87098-H
. [all data]
Hunter and Lias, 1998
Hunter, E.P.; Lias, S.G.,
Evaluated Gas Phase Basicities and Proton Affinities of Molecules: An Update,
J. Phys. Chem. Ref. Data, 1998, 27, 3, 413-656, https://doi.org/10.1063/1.556018
. [all data]
Chen and Cooks, 1995
Chen, G.D.; Cooks, R.G.,
Electron affinities of polycyclic aromatic hydrocarbons determined by the kinetic method,
J. Mass Spectrom., 1995, 30, 8, 1167, https://doi.org/10.1002/jms.1190300814
. [all data]
Aue, Guidoni, et al., 2000
Aue, D.H.; Guidoni, M.; Betowski, L.D.,
Ab initio calculated gas-phase basicities of polynuclear aromatic hydrocarbons,
Int. J. Mass Spectrom., 2000, 201, 283. [all data]
Mautner(Meot-Ner), 1980
Mautner(Meot-Ner), M.,
Ion thermochemistry of low volatility compounds in the gas phase. 3. Polycyclic aromatics: Ionization energies, proton, and hydrogen affinities. Extrapolations to graphite,
J. Phys. Chem., 1980, 84, 2716. [all data]
Clar and Schmidt, 1977
Clar, E.; Schmidt, W.,
Correlations between photoelectron and ultraviolet absorption spectra of polycyclic hydrocarbons. The perylene, coronene and bisanthene series,
Tetrahedron, 1977, 33, 2093. [all data]
Boschi, Murrell, et al., 1972
Boschi, R.; Murrell, J.N.; Schmidt, W.,
Photoelectron spectra of polycyclic aromatic hydrocarbons,
Faraday Discuss. Chem. Soc., 1972, 54, 116. [all data]
Briegleb, 1964
Briegleb, G.,
Electron affinity of organic molecules,
Angew. Chem. Intern. Ed., 1964, 3, 617. [all data]
Matsen, 1956
Matsen, F.A.,
Electron affinities, methyl affinities, and ionization energies of condensed ring aromatic hydrocarbons,
J. Chem. Phys., 1956, 24, 602. [all data]
Clar and Schmidt, 1976
Clar, E.; Schmidt, W.,
Correlations between photoelectron and phosphorescence spectra of polycyclic hydrocarbons,
Tetrahedron, 1976, 32, 2563. [all data]
Meot-Ner (Mautner), 1980
Meot-Ner (Mautner), M.,
Dimer Cations of Polycyclic Aromatics: Experimental Bonding Energies and Resonance Stabilization,
J. Phys. Chem., 1980, 84, 21, 2724, https://doi.org/10.1021/j100458a012
. [all data]