Imidazolidine,2-(1,3-dimethyl-2-imidazolidinylidene)-1,3-dimethyl-

Gas phase ion energetics data

Data compiled by: Sharon G. Lias, Rhoda D. Levin, and Sherif A. Kafafi

Ionization energy determinations

IE (eV) Method Reference Comment
≤5.41PINakato, Ozaki, et al., 1972
≤5.41 ± 0.02PINakato, Ozaki, et al., 1971
6.06PECetinkaya, King, et al., 1971Vertical value

References

Nakato, Ozaki, et al., 1972
Nakato, Y.; Ozaki, M.; Tsubomura, H., Ionization energies and Rydberg states of tetraaminoethylenes, Bull. Chem. Soc. Jpn., 1972, 45, 1299. [all data]

Nakato, Ozaki, et al., 1971
Nakato, Y.; Ozaki, M.; Egawa, A.; Tsubornura, H., Organic amino compounds with very low ionization potentials, Chem. Phys. Lett., 1971, 9, 615. [all data]

Cetinkaya, King, et al., 1971
Cetinkaya, B.; King, G.H.; Krishnamurthy, S.S.; Lappert, M.F.; Pedley, J.B., Photoelectron spectra of electron-rich olefins and an isostructural boron compound; olefins of exceptionally low first ionisation potential, Chem. Commun., 1971, 1370. [all data]