Germane, trimethyl(3,3,3-trifluoro-1-propynyl)-
- Formula: C6H9F3Ge
- Molecular weight: 210.77
- IUPAC Standard InChIKey: QOVNFXGPVSXFLC-UHFFFAOYSA-N
- CAS Registry Number: 19097-37-1
- Chemical structure:
View 3d structure (requires JavaScript / HTML 5) - Permanent link for this species. Use this link for bookmarking this species for future reference.

Gas phase ion energetics data

Data compiled by: Sharon G. Lias, Rhoda D. Levin, and Sherif A. Kafafi
Appearance energy determinations
Ion | AE (eV) | Other Products | Method | Reference | Comment |
---|---|---|---|---|---|
C5H6F3Ge+ | 10.11 ± 0.05 | CH3 | PI | Takhistov, Khlebnikova, et al., 1980 |

References

Takhistov, Khlebnikova, et al., 1980
Takhistov, V.; Khlebnikova, N.; Orlov, V.,
Photoionization study of energetic properties of cations formed with fragmentation of substituted acetylenes containing elements of IV B group,
Org. React. Tartu, 1980, 17, 449. [all data]