Dibenzo[b,pqr]perylene
- Formula: C26H14
- Molecular weight: 326.3894
- IUPAC Standard InChIKey: UJPJAAQMHAHWRM-UHFFFAOYSA-N
- CAS Registry Number: 190-95-4
- Chemical structure:
View 3d structure (requires JavaScript / HTML 5) - Permanent link for this species. Use this link for bookmarking this species for future reference.

Gas phase ion energetics data

Data compiled as indicated in comments:
LLK - Sharon G. Lias, Rhoda D. Levin, and Sherif A. Kafafi
RDSH - Henry M. Rosenstock, Keith Draxl, Bruce W. Steiner, and John T. Herron
Ionization energy determinations
IE (eV) | Method | Reference | Comment |
---|---|---|---|
7.12 | PE | Clar and Schmidt, 1977 | LLK |
7.41 | CTS | Briegleb, 1964 | RDSH |
7.20 | CTS | Matsen, 1956 | RDSH |
7.12 | PE | Clar and Schmidt, 1977 | Vertical value; LLK |

References

Clar and Schmidt, 1977
Clar, E.; Schmidt, W.,
Correlations between photoelectron and ultraviolet absorption spectra of polycyclic hydrocarbons. The perylene, coronene and bisanthene series,
Tetrahedron, 1977, 33, 2093. [all data]
Briegleb, 1964
Briegleb, G.,
Electron affinity of organic molecules,
Angew. Chem. Intern. Ed., 1964, 3, 617. [all data]
Matsen, 1956
Matsen, F.A.,
Electron affinities, methyl affinities, and ionization energies of condensed ring aromatic hydrocarbons,
J. Chem. Phys., 1956, 24, 602. [all data]
Clar, 1948
Clar, E.,
Chem. Ber., 1948, 81, 520. [all data]