Benzo[rs]dinaphtho[2,1,8,7-klmn:3',2',1',8',7'-vwxyz]hexaphene

Gas phase ion energetics data

Data compiled by: Sharon G. Lias, Rhoda D. Levin, and Sherif A. Kafafi

Ionization energy determinations

IE (eV) Method Reference
6.38 ± 0.02PEClar and Schmidt, 1978

References

Clar and Schmidt, 1978
Clar, E.; Schmidt, W., Correlations between photoelectron and ultravioet absorption spectra of polycyclic hydrocarbons. The terrylene and peropyrene series, Tetrahedron, 1978, 34, 3219. [all data]