Benzo[qr]naphtho[2,1,8,7-fghi]pentacene
- Formula: C30H16
- Molecular weight: 376.4480
- IUPAC Standard InChIKey: AVVLVJLIKRMPQZ-UHFFFAOYSA-N
- CAS Registry Number: 190-87-4
- Chemical structure:
View 3d structure (requires JavaScript / HTML 5) - Permanent link for this species. Use this link for bookmarking this species for future reference.

Gas phase ion energetics data

Data compiled as indicated in comments:
LLK - Sharon G. Lias, Rhoda D. Levin, and Sherif A. Kafafi
RDSH - Henry M. Rosenstock, Keith Draxl, Bruce W. Steiner, and John T. Herron
Ionization energy determinations
IE (eV) | Method | Reference | Comment |
---|---|---|---|
6.97 | PE | Clar and Schmidt, 1977 | LLK |
7.27 | CTS | Briegleb, 1964 | RDSH |
7.03 | CTS | Matsen, 1956 | RDSH |
6.97 | PE | Clar and Schmidt, 1977 | Vertical value; LLK |

References

Clar and Schmidt, 1977
Clar, E.; Schmidt, W.,
Correlations between photoelectron and ultraviolet absorption spectra of polycyclic hydrocarbons. The perylene, coronene and bisanthene series,
Tetrahedron, 1977, 33, 2093. [all data]
Briegleb, 1964
Briegleb, G.,
Electron affinity of organic molecules,
Angew. Chem. Intern. Ed., 1964, 3, 617. [all data]
Matsen, 1956
Matsen, F.A.,
Electron affinities, methyl affinities, and ionization energies of condensed ring aromatic hydrocarbons,
J. Chem. Phys., 1956, 24, 602. [all data]