Naphtho[1,2,3,4-ghi]perylene
- Formula: C26H14
- Molecular weight: 326.3894
- IUPAC Standard InChIKey: LGERRYPEGFPVAJ-UHFFFAOYSA-N
- CAS Registry Number: 190-84-1
- Chemical structure:
View 3d structure (requires JavaScript / HTML 5) - Permanent link for this species. Use this link for bookmarking this species for future reference.

Phase change data

Data compiled as indicated in comments:
TRC - Thermodynamics Research Center, NIST Boulder Laboratories, Chris Muzny director
AC - William E. Acree, Jr., James S. Chickos
Quantity | Value | Units | Method | Reference | Comment |
---|---|---|---|---|---|
Tfus | 541.5 | K | N/A | Smith, 1980 | Uncertainty assigned by TRC = 0.4 K; TRC |
Enthalpy of fusion
ΔfusH (kJ/mol) | Temperature (K) | Reference | Comment |
---|---|---|---|
17.28 | 541.5 | Acree, 1991 | AC |

Gas phase ion energetics data

Data compiled by: Sharon G. Lias, Rhoda D. Levin, and Sherif A. Kafafi
Ionization energy determinations
IE (eV) | Method | Reference | Comment |
---|---|---|---|
6.96 | PE | Clar and Schmidt, 1977 | |
6.96 | PE | Clar and Schmidt, 1977 | Vertical value |

References

Smith, 1980
Smith, G.W.,
Phase behavior of some condensed polycyclic aromatics,
Mol. Cryst. Liq. Cryst., 1980, 64, 15. [all data]
Acree, 1991
Acree, William E.,
Thermodynamic properties of organic compounds: enthalpy of fusion and melting point temperature compilation,
Thermochimica Acta, 1991, 189, 1, 37-56, https://doi.org/10.1016/0040-6031(91)87098-H
. [all data]
Clar and Schmidt, 1977
Clar, E.; Schmidt, W.,
Correlations between photoelectron and ultraviolet absorption spectra of polycyclic hydrocarbons. The perylene, coronene and bisanthene series,
Tetrahedron, 1977, 33, 2093. [all data]