Tribenzo[b,n,pqr]perylene
- Formula: C30H16
- Molecular weight: 376.4480
- IUPAC Standard InChIKey: OCHHCTQLQKUZDD-UHFFFAOYSA-N
- CAS Registry Number: 190-81-8
- Chemical structure:
View 3d structure (requires JavaScript / HTML 5) - Permanent link for this species. Use this link for bookmarking this species for future reference.

Gas phase ion energetics data

Data compiled by: Sharon G. Lias, Rhoda D. Levin, and Sherif A. Kafafi
Ionization energy determinations
IE (eV) | Method | Reference | Comment |
---|---|---|---|
7.13 | PE | Clar and Schmidt, 1977 | |
7.13 | PE | Clar and Schmidt, 1977 | Vertical value |
7.13 | PE | Clar and Schmidt, 1976 | Vertical value |

References

Clar and Schmidt, 1977
Clar, E.; Schmidt, W.,
Correlations between photoelectron and ultraviolet absorption spectra of polycyclic hydrocarbons. The perylene, coronene and bisanthene series,
Tetrahedron, 1977, 33, 2093. [all data]
Clar and Schmidt, 1976
Clar, E.; Schmidt, W.,
Correlations between photoelectron and phosphorescence spectra of polycyclic hydrocarbons,
Tetrahedron, 1976, 32, 2563. [all data]