Pyrazole, 3,4,4,5-tetramethyl-
- Formula: C7H12N2
- Molecular weight: 124.1836
- IUPAC Standard InChIKey: AIHABYFCZQBWLH-UHFFFAOYSA-N
- CAS Registry Number: 19078-32-1
- Chemical structure:
View 3d structure (requires JavaScript / HTML 5) - Other names: 4H-Pyrazole,3,4,4,5-tetramethyl-

Gas phase ion energetics data

Data compiled by: Sharon G. Lias, Rhoda D. Levin, and Sherif A. Kafafi
Ionization energy determinations
IE (eV) | Method | Reference | Comment |
---|---|---|---|
9.57 | PE | Rademacher, 1975 | Vertical value |
10.12 | PE | Rademacher, 1973 | Vertical value |

References

Rademacher, 1975
Rademacher, P.,
Acyclische Hydrazine,
Chem. Ber., 1975, 108, 1548. [all data]
Rademacher, 1973
Rademacher, P.,
Photoelectron spectra and conformation of hydrazine derivatives,
Angew. Chem. Int. Ed. Engl., 1973, 12, 408. [all data]