Dibenzo[a,j]coronene
- Formula: C32H16
- Molecular weight: 400.4694
- IUPAC Standard InChIKey: HHCCABYUXOGSCO-UHFFFAOYSA-N
- CAS Registry Number: 190-72-7
- Chemical structure:
View 3d structure (requires JavaScript / HTML 5) - Permanent link for this species. Use this link for bookmarking this species for future reference.

Gas phase ion energetics data

Data compiled by: Sharon G. Lias, Rhoda D. Levin, and Sherif A. Kafafi
Ionization energy determinations
IE (eV) | Method | Reference | Comment |
---|---|---|---|
6.92 | PE | Clar and Schmidt, 1977 | |
6.92 | PE | Clar and Schmidt, 1977 | Vertical value |
6.92 | PE | Clar and Schmidt, 1976 | Vertical value |

References

Clar and Schmidt, 1977
Clar, E.; Schmidt, W.,
Correlations between photoelectron and ultraviolet absorption spectra of polycyclic hydrocarbons. The perylene, coronene and bisanthene series,
Tetrahedron, 1977, 33, 2093. [all data]
Clar and Schmidt, 1976
Clar, E.; Schmidt, W.,
Correlations between photoelectron and phosphorescence spectra of polycyclic hydrocarbons,
Tetrahedron, 1976, 32, 2563. [all data]
Clar and Zander, 1957
Clar, E.; Zander, M.,
J. Chem. Soc., 1957, 4616. [all data]