n-Butoxy radical
- Formula: C4H9O
- Molecular weight: 73.1137
- IUPAC Standard InChIKey: QOOQLKSEGVNYLA-UHFFFAOYSA-N
- CAS Registry Number: 19062-98-7
- Chemical structure:
View 3d structure (requires JavaScript / HTML 5) - Permanent link for this species. Use this link for bookmarking this species for future reference.

Gas phase ion energetics data

Data compiled as indicated in comments:
RDSH - Henry M. Rosenstock, Keith Draxl, Bruce W. Steiner, and John T. Herron
B - John E. Bartmess
Electron affinity determinations
EA (eV) | Method | Reference | Comment |
---|---|---|---|
1.78 ± 0.10 | D-EA | Bartmess, Scott, et al., 1979 | value altered from reference due to change in acidity scale; B |
1.80 ± 0.13 | D-EA | Boand, Houriet, et al., 1983 | value altered from reference due to change in acidity scale; B |
1.90 ± 0.10 | EIAE | Williams and Hamill, 1968 | From nBuONO; B |
0.888965 | SI | Page and Goode, 1969 | The Magnetron method, lacking mass analysis, is not considered reliable.; B |
Ionization energy determinations
IE (eV) | Method | Reference | Comment |
---|---|---|---|
9.22 ± 0.05 | EI | Williams and Hamill, 1968 | RDSH |

References

Bartmess, Scott, et al., 1979
Bartmess, J.E.; Scott, J.A.; McIver, R.T., Jr.,
The gas phase acidity scale from methanol to phenol,
J. Am. Chem. Soc., 1979, 101, 6047. [all data]
Boand, Houriet, et al., 1983
Boand, G.; Houriet, R.; Baumann, T.,
The gas phase acidity of aliphatic alcohols,
J. Am. Chem. Soc., 1983, 105, 2203. [all data]
Williams and Hamill, 1968
Williams, J.M.; Hamill, W.H.,
Ionization potentials of molecules and free radicals and appearance potentials by electron impact in the mass spectrometer,
J. Chem. Phys., 1968, 49, 4467. [all data]
Page and Goode, 1969
Page, F.M.; Goode, G.C.,
Negative Ions and the Magnetron., Wiley, NY, 1969. [all data]