Dibenzo[bc,kl]coronene
- Formula: C30H14
- Molecular weight: 374.4322
- IUPAC Standard InChIKey: HIPGYGZSSWEWRX-UHFFFAOYSA-N
- CAS Registry Number: 190-55-6
- Chemical structure:
View 3d structure (requires JavaScript / HTML 5) - Permanent link for this species. Use this link for bookmarking this species for future reference.

Gas phase thermochemistry data

Data compiled by: Glushko Thermocenter, Russian Academy of Sciences, Moscow
Constant pressure heat capacity of gas
Cp,gas (J/mol*K) | Temperature (K) | Reference | Comment |
---|---|---|---|
55.62 | 50. | Dorofeeva O.V., 1988 | Recommended values were calculated statistically mechanically using force field approximation for polycyclic aromatic hydrocarbons to estimate the needed vibrational frequencies (see also [ Dorofeeva O.V., 1986, Moiseeva N.F., 1989]). These functions are reproduced in the reference book [ Frenkel M., 1994]. |
100.69 | 100. | ||
158.37 | 150. | ||
222.50 | 200. | ||
320.13 | 273.15 | ||
353.1 ± 7.0 | 298.15 | ||
355.46 | 300. | ||
477.56 | 400. | ||
579.05 | 500. | ||
660.02 | 600. | ||
724.25 | 700. | ||
775.70 | 800. | ||
817.44 | 900. | ||
851.71 | 1000. | ||
880.14 | 1100. | ||
903.93 | 1200. | ||
923.99 | 1300. | ||
941.03 | 1400. | ||
955.59 | 1500. |

Gas phase ion energetics data

Data compiled by: Sharon G. Lias, Rhoda D. Levin, and Sherif A. Kafafi
Ionization energy determinations
IE (eV) | Method | Reference |
---|---|---|
6.42 ± 0.02 | PE | Clar and Schmidt, 1978 |

References

Dorofeeva O.V., 1988
Dorofeeva O.V.,
Thermodynamic Properties of Polycyclic Aromatic Hydrocarbons in the Gaseous Phase. Institute for High Temperatures, USSR Academy of Sciences, Preprint No.1-238 (in Russian), Moscow, 1988. [all data]
Dorofeeva O.V., 1986
Dorofeeva O.V.,
On calculation of thermodynamic properties of polycyclic aromatic hydrocarbons,
Thermochim. Acta, 1986, 102, 59-66. [all data]
Moiseeva N.F., 1989
Moiseeva N.F.,
Development of Benson group additivity method for estimation of ideal gas thermodynamic properties of polycyclic aromatic hydrocarbons,
Thermochim. Acta, 1989, 153, 77-85. [all data]
Frenkel M., 1994
Frenkel M.,
Thermodynamics of Organic Compounds in the Gas State, Vol. I, II, Thermodynamics Research Center, College Station, Texas, 1994, 1994. [all data]
Clar and Schmidt, 1978
Clar, E.; Schmidt, W.,
Correlations between photoelectron and ultravioet absorption spectra of polycyclic hydrocarbons. The terrylene and peropyrene series,
Tetrahedron, 1978, 34, 3219. [all data]