Phenanthro[1,10,9,8-opqra]perylene
- Formula: C28H14
- Molecular weight: 350.4108
- IUPAC Standard InChIKey: RYQHWGXLBQHJST-UHFFFAOYSA-N
- CAS Registry Number: 190-39-6
- Chemical structure:
View 3d structure (requires JavaScript / HTML 5) - Permanent link for this species. Use this link for bookmarking this species for future reference.

Gas phase thermochemistry data

Data compiled by: Glushko Thermocenter, Russian Academy of Sciences, Moscow
Constant pressure heat capacity of gas
Cp,gas (J/mol*K) | Temperature (K) | Reference | Comment |
---|---|---|---|
55.22 | 50. | Dorofeeva O.V., 1988 | Recommended values were calculated statistically mechanically using force field approximation for polycyclic aromatic hydrocarbons to estimate the needed vibrational frequencies (see also [ Dorofeeva O.V., 1986, Moiseeva N.F., 1989]). These functions are reproduced in the reference book [ Frenkel M., 1994]. |
100.32 | 100. | ||
155.19 | 150. | ||
215.32 | 200. | ||
307.03 | 273.15 | ||
338.1 ± 6.0 | 298.15 | ||
340.33 | 300. | ||
455.66 | 400. | ||
551.63 | 500. | ||
628.23 | 600. | ||
689.08 | 700. | ||
737.91 | 800. | ||
777.62 | 900. | ||
810.30 | 1000. | ||
837.47 | 1100. | ||
860.24 | 1200. | ||
879.49 | 1300. | ||
895.85 | 1400. | ||
909.86 | 1500. |

Phase change data

Data compiled by: William E. Acree, Jr., James S. Chickos
Enthalpy of vaporization
ΔvapH (kJ/mol) | Temperature (K) | Method | Reference | Comment |
---|---|---|---|---|
180.5 | 595. | A | Stephenson and Malanowski, 1987 | Based on data from 580. to 630. K. |
Enthalpy of sublimation
ΔsubH (kJ/mol) | Temperature (K) | Method | Reference |
---|---|---|---|
180.5 | 580. to 630. | N/A | Stephenson and Malanowski, 1987 |
181. ± 5. | 605. | ME | Inokuchi, Shiba, et al., 1952 |

Gas phase ion energetics data

Data compiled as indicated in comments:
LLK - Sharon G. Lias, Rhoda D. Levin, and Sherif A. Kafafi
RDSH - Henry M. Rosenstock, Keith Draxl, Bruce W. Steiner, and John T. Herron
Ionization energy determinations
IE (eV) | Method | Reference | Comment |
---|---|---|---|
6.30 | PE | Clar and Schmidt, 1977 | LLK |
6.42 | CTS | Kuroda, 1964 | RDSH |
6.30 | PE | Clar and Schmidt, 1977 | Vertical value; LLK |

References

Dorofeeva O.V., 1988
Dorofeeva O.V.,
Thermodynamic Properties of Polycyclic Aromatic Hydrocarbons in the Gaseous Phase. Institute for High Temperatures, USSR Academy of Sciences, Preprint No.1-238 (in Russian), Moscow, 1988. [all data]
Dorofeeva O.V., 1986
Dorofeeva O.V.,
On calculation of thermodynamic properties of polycyclic aromatic hydrocarbons,
Thermochim. Acta, 1986, 102, 59-66. [all data]
Moiseeva N.F., 1989
Moiseeva N.F.,
Development of Benson group additivity method for estimation of ideal gas thermodynamic properties of polycyclic aromatic hydrocarbons,
Thermochim. Acta, 1989, 153, 77-85. [all data]
Frenkel M., 1994
Frenkel M.,
Thermodynamics of Organic Compounds in the Gas State, Vol. I, II, Thermodynamics Research Center, College Station, Texas, 1994, 1994. [all data]
Stephenson and Malanowski, 1987
Stephenson, Richard M.; Malanowski, Stanislaw,
Handbook of the Thermodynamics of Organic Compounds, 1987, https://doi.org/10.1007/978-94-009-3173-2
. [all data]
Inokuchi, Shiba, et al., 1952
Inokuchi, Hiroo; Shiba, Sukekuni; Handa, Takashi; Akamatu, Hideo,
Heats of Sublimation of Condensed Polynuclear Aromatic Hydrocarbons,
Bull. Chem. Soc. Jpn., 1952, 25, 5, 299-302, https://doi.org/10.1246/bcsj.25.299
. [all data]
Clar and Schmidt, 1977
Clar, E.; Schmidt, W.,
Correlations between photoelectron and ultraviolet absorption spectra of polycyclic hydrocarbons. The perylene, coronene and bisanthene series,
Tetrahedron, 1977, 33, 2093. [all data]
Kuroda, 1964
Kuroda, H.,
Ionization potentials of polycyclic aromatic hydrocarbons,
Nature, 1964, 201, 1214. [all data]