Ovalene
- Formula: C32H14
- Molecular weight: 398.4536
- IUPAC Standard InChIKey: LSQODMMMSXHVCN-UHFFFAOYSA-N
- CAS Registry Number: 190-26-1
- Chemical structure:
View 3d structure (requires JavaScript / HTML 5) - Permanent link for this species. Use this link for bookmarking this species for future reference.

Gas phase thermochemistry data

Data compiled by: Glushko Thermocenter, Russian Academy of Sciences, Moscow
Constant pressure heat capacity of gas
Cp,gas (J/mol*K) | Temperature (K) | Reference | Comment |
---|---|---|---|
55.97 | 50. | Dorofeeva O.V., 1988 | Recommended values were calculated statistically mechanically using force field approximation for polycyclic aromatic hydrocarbons to estimate the needed vibrational frequencies (see also [ Dorofeeva O.V., 1986, Moiseeva N.F., 1989]). These functions are reproduced in the reference book [ Frenkel M., 1994]. |
102.32 | 100. | ||
163.38 | 150. | ||
231.43 | 200. | ||
334.54 | 273.15 | ||
369.2 ± 8.0 | 298.15 | ||
371.74 | 300. | ||
500.17 | 400. | ||
606.93 | 500. | ||
692.10 | 600. | ||
759.64 | 700. | ||
813.64 | 800. | ||
857.37 | 900. | ||
893.21 | 1000. | ||
922.88 | 1100. | ||
947.67 | 1200. | ||
968.54 | 1300. | ||
986.25 | 1400. | ||
1001.36 | 1500. |

Phase change data

Data compiled as indicated in comments:
TRC - Thermodynamics Research Center, NIST Boulder Laboratories, Chris Muzny director
AC - William E. Acree, Jr., James S. Chickos
CAL - James S. Chickos, William E. Acree, Jr., Joel F. Liebman, Students of Chem 202 (Introduction to the Literature of Chemistry), University of Missouri -- St. Louis
Quantity | Value | Units | Method | Reference | Comment |
---|---|---|---|---|---|
Tfus | 770.1 | K | N/A | Smith, 1980 | Crystal phase 1 phase; Uncertainty assigned by TRC = 0.6 K; TRC |
Enthalpy of sublimation
ΔsubH (kJ/mol) | Temperature (K) | Method | Reference | Comment |
---|---|---|---|---|
211.7 ± 7.9 | 600. | ME | Inokuchi, Shiba, et al., 1952 | AC |
Enthalpy of fusion
ΔfusH (kJ/mol) | Temperature (K) | Reference | Comment |
---|---|---|---|
17.4 | 770.1 | Smith, 1979 | AC |
Entropy of fusion
ΔfusS (J/mol*K) | Temperature (K) | Reference | Comment |
---|---|---|---|
11.08 | 729. | Smith, 1979, 2 | CAL |
22.59 | 770.1 |

Gas phase ion energetics data

Data compiled as indicated in comments:
LLK - Sharon G. Lias, Rhoda D. Levin, and Sherif A. Kafafi
RDSH - Henry M. Rosenstock, Keith Draxl, Bruce W. Steiner, and John T. Herron
Ionization energy determinations
IE (eV) | Method | Reference | Comment |
---|---|---|---|
6.71 | PE | Clar, Robertson, et al., 1981 | LLK |
6.86 ± 0.01 | PE | Boschi, Murrell, et al., 1972 | LLK |
7.2 ± 0.1 | EI | Gallegos, 1968 | RDSH |
7.01 | CTS | Kuroda, 1964 | RDSH |
6.71 | PE | Clar and Schmidt, 1977 | Vertical value; LLK |

References

Dorofeeva O.V., 1988
Dorofeeva O.V.,
Thermodynamic Properties of Polycyclic Aromatic Hydrocarbons in the Gaseous Phase. Institute for High Temperatures, USSR Academy of Sciences, Preprint No.1-238 (in Russian), Moscow, 1988. [all data]
Dorofeeva O.V., 1986
Dorofeeva O.V.,
On calculation of thermodynamic properties of polycyclic aromatic hydrocarbons,
Thermochim. Acta, 1986, 102, 59-66. [all data]
Moiseeva N.F., 1989
Moiseeva N.F.,
Development of Benson group additivity method for estimation of ideal gas thermodynamic properties of polycyclic aromatic hydrocarbons,
Thermochim. Acta, 1989, 153, 77-85. [all data]
Frenkel M., 1994
Frenkel M.,
Thermodynamics of Organic Compounds in the Gas State, Vol. I, II, Thermodynamics Research Center, College Station, Texas, 1994, 1994. [all data]
Smith, 1980
Smith, G.W.,
Phase behavior of some condensed polycyclic aromatics,
Mol. Cryst. Liq. Cryst., 1980, 64, 15. [all data]
Inokuchi, Shiba, et al., 1952
Inokuchi, Hiroo; Shiba, Sukekuni; Handa, Takashi; Akamatu, Hideo,
Heats of Sublimation of Condensed Polynuclear Aromatic Hydrocarbons,
Bull. Chem. Soc. Jpn., 1952, 25, 5, 299-302, https://doi.org/10.1246/bcsj.25.299
. [all data]
Smith, 1979
Smith, George W.,
Phase behavior and nucleation kinetics of Octaphenylcyclotetrasiloxane,
Phase Transitions, 1979, 1, 2, 107-129, https://doi.org/10.1080/01411597908213195
. [all data]
Smith, 1979, 2
Smith, G.W.,
Mol. Cryst. Liq. Cryst., 1979, 15. [all data]
Clar, Robertson, et al., 1981
Clar, E.; Robertson, J.M.; Schlogl, R.; Schmidt, W.,
Photoelectron spectra of polynuclear aromatics. 6. Application to structural elucidation: 'Circumanthracene',
J. Am. Chem. Soc., 1981, 103, 1320. [all data]
Boschi, Murrell, et al., 1972
Boschi, R.; Murrell, J.N.; Schmidt, W.,
Photoelectron spectra of polycyclic aromatic hydrocarbons,
Faraday Discuss. Chem. Soc., 1972, 54, 116. [all data]
Gallegos, 1968
Gallegos, E.J.,
Mass spectrometry and ionization energies of some condensed-ring aromatic and heterocyclic compounds,
J. Phys. Chem., 1968, 72, 3452. [all data]
Kuroda, 1964
Kuroda, H.,
Ionization potentials of polycyclic aromatic hydrocarbons,
Nature, 1964, 201, 1214. [all data]
Clar and Schmidt, 1977
Clar, E.; Schmidt, W.,
Correlations between photoelectron and ultraviolet absorption spectra of polycyclic hydrocarbons. The perylene, coronene and bisanthene series,
Tetrahedron, 1977, 33, 2093. [all data]