Hexabenzo[bc:ef:hi:kl:no:qr]coronene
- Formula: C42H18
- Molecular weight: 522.5923
- IUPAC Standard InChIKey: IVJZBYVRLJZOOQ-UHFFFAOYSA-N
- CAS Registry Number: 190-24-9
- Chemical structure:
View 3d structure (requires JavaScript / HTML 5) - Other names: 1:12,2:3,4:5,6:7,8:9,10:11-Hexabenzocoronene; Hexabenzo[bc,ef,hi,kl,no,qr]coronene

Gas phase ion energetics data

Data compiled as indicated in comments:
LLK - Sharon G. Lias, Rhoda D. Levin, and Sherif A. Kafafi
RDSH - Henry M. Rosenstock, Keith Draxl, Bruce W. Steiner, and John T. Herron
Ionization energy determinations
IE (eV) | Method | Reference | Comment |
---|---|---|---|
7.1 ± 0.1 | EI | Gallegos, 1968 | RDSH |
6.87 ± 0.02 | PE | Clar and Schmidt, 1978 | Vertical value; LLK |
6.87 | PE | Clar and Schmidt, 1977 | Vertical value; LLK |
6.89 | PE | Clar and Schmidt, 1976 | Vertical value; LLK |

References

Gallegos, 1968
Gallegos, E.J.,
Mass spectrometry and ionization energies of some condensed-ring aromatic and heterocyclic compounds,
J. Phys. Chem., 1968, 72, 3452. [all data]
Clar and Schmidt, 1978
Clar, E.; Schmidt, W.,
Correlations between photoelectron and ultravioet absorption spectra of polycyclic hydrocarbons. The terrylene and peropyrene series,
Tetrahedron, 1978, 34, 3219. [all data]
Clar and Schmidt, 1977
Clar, E.; Schmidt, W.,
Correlations between photoelectron and ultraviolet absorption spectra of polycyclic hydrocarbons. The perylene, coronene and bisanthene series,
Tetrahedron, 1977, 33, 2093. [all data]
Clar and Schmidt, 1976
Clar, E.; Schmidt, W.,
Correlations between photoelectron and phosphorescence spectra of polycyclic hydrocarbons,
Tetrahedron, 1976, 32, 2563. [all data]