Dibenzo[f,j]phenanthro[9,10-s]picene
- Formula: C42H24
- Molecular weight: 528.6400
- IUPAC Standard InChIKey: YJPAVAGSCBGPCP-UHFFFAOYSA-N
- CAS Registry Number: 190-23-8
- Chemical structure:
View 3d structure (requires JavaScript / HTML 5) - Permanent link for this species. Use this link for bookmarking this species for future reference.

Gas phase ion energetics data

Data compiled by: Sharon G. Lias, Rhoda D. Levin, and Sherif A. Kafafi
Ionization energy determinations
IE (eV) | Method | Reference |
---|---|---|
7.52 ± 0.02 | PE | Schmidt, 1977 |

References

Schmidt, 1977
Schmidt, W.,
Photoelectron spectra of polynuclear aromatics. V. Correlations with ultraviolet absorption spectra in the catacondensed series,
J. Chem. Phys., 1977, 66, 828. [all data]