9H-Thioxanthene,9,9-dimethyl-

Gas phase ion energetics data

Data compiled by: Sharon G. Lias, Rhoda D. Levin, and Sherif A. Kafafi

Ionization energy determinations

IE (eV) Method Reference
7.7 ± 0.1EIInnorta, Torroni, et al., 1977

Appearance energy determinations

Ion AE (eV) Other Products MethodReferenceComment
C14H11S+8.3 ± 0.1CH3EIInnorta, Torroni, et al., 1977

References

Innorta, Torroni, et al., 1977
Innorta, G.; Torroni, S.; Distefano, G.; Pietropaolo, D.; Ricci, A., Mass spectra and energetic data for the formation of the [M-CH3]+ ion of 10,10-dimethylphenylthio-silyn, -germyn and -stannyn derivatives and of 9,9-dimethylthioxantene, Org. Mass Spectrom., 1977, 12, 766. [all data]