p,p,p-Trimethylphosphine-borane
- Formula: C3H12BP
- Molecular weight: 89.912
- IUPAC Standard InChIKey: XDZLUCBMKWYLJG-UHFFFAOYSA-N
- CAS Registry Number: 1898-77-7
- Chemical structure:
View 3d structure (requires JavaScript / HTML 5) - Permanent link for this species. Use this link for bookmarking this species for future reference.

Reaction thermochemistry data

Data compiled by: John E. Bartmess
Individual Reactions
C3H11BP- + =
By formula: C3H11BP- + H+ = C3H12BP
Quantity | Value | Units | Method | Reference | Comment |
---|---|---|---|---|---|
ΔrH° | 1567. ± 8.8 | kJ/mol | G+TS | Ren, Workman, et al., 1998 | gas phase |
Quantity | Value | Units | Method | Reference | Comment |
ΔrG° | 1529. ± 8.4 | kJ/mol | IMRB | Ren, Workman, et al., 1998 | gas phase |

Gas phase ion energetics data

Data compiled as indicated in comments:
B - John E. Bartmess
LBLHLM - Sharon G. Lias, John E. Bartmess, Joel F. Liebman, John L. Holmes, Rhoda D. Levin, and W. Gary Mallard
Ionization energy determinations
IE (eV) | Method | Reference | Comment |
---|---|---|---|
10.15 | PE | Cowley, Kemp, et al., 1982 | Vertical value; LBLHLM |
De-protonation reactions
C3H11BP- + =
By formula: C3H11BP- + H+ = C3H12BP
Quantity | Value | Units | Method | Reference | Comment |
---|---|---|---|---|---|
ΔrH° | 1567. ± 8.8 | kJ/mol | G+TS | Ren, Workman, et al., 1998 | gas phase; B |
Quantity | Value | Units | Method | Reference | Comment |
ΔrG° | 1529. ± 8.4 | kJ/mol | IMRB | Ren, Workman, et al., 1998 | gas phase; B |

References

Ren, Workman, et al., 1998
Ren, J.H.; Workman, D.B.; Squires, R.R.,
Gas-phase negative ion chemistry of Lewis acid-base complexes,
J. Am. Chem. Soc., 1998, 120, 40, 10511-10522, https://doi.org/10.1021/ja9804518
. [all data]
Cowley, Kemp, et al., 1982
Cowley, A.H.; Kemp, R.A.; Lattman, M.; McKee, M.L.,
Lewis base behavior of methylated and fluorinated phosphines. A photoelectron spectroscopic investigation,
Inorg. Chem., 1982, 21, 85. [all data]