4,4'-Diisopropylbiphenyl
- Formula: C18H22
- Molecular weight: 238.3673
- IUPAC Standard InChIKey: NUEUMFZLNOCRCQ-UHFFFAOYSA-N
- CAS Registry Number: 18970-30-4
- Chemical structure:
View 3d structure (requires JavaScript / HTML 5) - Other names: 1,1'-Biphenyl, 4,4'-bis-(1-methylethyl); 1,1'-Biphenyl, 4,4'-diisopropyl; p,p'-Diisopropylbiphenyl; Biphenyl, 4,4'-diisopropyl-; 3,4'-Diisopropylbiphenyl

Condensed phase thermochemistry data

Data compiled by: Eugene S. Domalski and Elizabeth D. Hearing
Constant pressure heat capacity of liquid
Cp,liquid (J/mol*K) | Temperature (K) | Reference | Comment |
---|---|---|---|
520.5 | 422. | McEwen, March 31 1956 | T = 300 to 600°F. |

Phase change data

Data compiled by: Thermodynamics Research Center, NIST Boulder Laboratories, Chris Muzny director
Quantity | Value | Units | Method | Reference | Comment |
---|---|---|---|---|---|
Tboil | 608. | K | N/A | Bert, 1923 | Uncertainty assigned by TRC = 10. K; this sample was probably 2-phenyl-2-(p-isopropylphenyl)-propane. See 1929 boe 0 |
Quantity | Value | Units | Method | Reference | Comment |
Tfus | 339. | K | N/A | Everitt, Hall, et al., 1956 | Uncertainty assigned by TRC = 4. K |
Tfus | 322. | K | N/A | Boedtker, 1929 | Uncertainty assigned by TRC = 3. K |
Tfus | 338. | K | N/A | Bert, 1923 | Uncertainty assigned by TRC = 20. K; this material was probably 2-phenyl-2-(p-isopropylphenyl)-propane. See 1929 boe 0 |
Tfus | 322. | K | N/A | Schreiner, 1911 | Uncertainty assigned by TRC = 2. K |

Reaction thermochemistry data

Data compiled by: Hussein Y. Afeefy, Joel F. Liebman, and Stephen E. Stein
Individual Reactions
By formula: C18H22 = C18H22
Quantity | Value | Units | Method | Reference | Comment |
---|---|---|---|---|---|
ΔrH° | 0.47 ± 0.06 | kJ/mol | Eqk | Roshchupkina, Nesterova, et al., 1987 | liquid phase; T=367.3 K |

Kovats' RI, non-polar column, isothermal

Column type | Active phase | Temperature (C) | I | Reference | Comment |
---|---|---|---|---|---|
Capillary | Apiezon L | 200. | 1963. | Krupcík, Leclercq, et al., 1980 | N2; Column length: 50. m; Column diameter: 0.25 mm |

References

McEwen, March 31 1956
McEwen, M.,
Preliminary engineering study of organic nuclear reactor coolant-moderators Monsanto Chemical Co, March 31 1956. [all data]
Bert, 1923
Bert, L.,
C. R. Hebd. Seances Acad. Sci., 1923, 177, 452. [all data]
Everitt, Hall, et al., 1956
Everitt, P.M.; Hall, D.M.; Turner, E.E.,
Relation Between Configuration and Conjugation in Biphenyl Derivatives,
J. Chem. Soc., 1956, 1956, 2286-90. [all data]
Boedtker, 1929
Boedtker, E.,
Bull. Soc. Chim. Fr., 1929, 45, 645. [all data]
Schreiner, 1911
Schreiner,
J. Prakt. Chem., 1911, 81, 422. [all data]
Roshchupkina, Nesterova, et al., 1987
Roshchupkina, I.Yu.; Nesterova, T.N.; Rozhnov, A.M.,
Equilibria of isomeric transformations of alkylbiphenyls,
J. Chem. Thermodyn., 1987, 19, 299-306. [all data]
Krupcík, Leclercq, et al., 1980
Krupcík, J.; Leclercq, P.A.; Garaj, J.; Símová, A.,
Analysis of alkylated mixtures of polychlorinated biphenyls by capillary gas chromatography-mass spectrometry,
J. Chromatogr., 1980, 191, 207-220, https://doi.org/10.1016/S0021-9673(00)86381-5
. [all data]