Tris(trimethylsilyl)ethylene
- Formula: C11H28Si3
- Molecular weight: 244.5965
- IUPAC Standard InChIKey: CUFNUQSBSOKXJH-UHFFFAOYSA-N
- CAS Registry Number: 18938-24-4
- Chemical structure:
View 3d structure (requires JavaScript / HTML 5) - Other names: [2,2-Bis(trimethylsilyl)vinyl](trimethyl)silane; Tris(trimethylsilyl)ethene

Gas phase ion energetics data

Data compiled by: Henry M. Rosenstock, Keith Draxl, Bruce W. Steiner, and John T. Herron
Ionization energy determinations
IE (eV) | Method | Reference |
---|---|---|
8.85 ± 0.04 | EI | Bock and Seidl, 1968 |

References

Bock and Seidl, 1968
Bock, H.; Seidl, H.,
d-Orbitaleffekte in siliziumsubstituierten π-Elektronensystemen. VI. Spektroskopische Untersuchungen an Alkyl- und Silylathylenen,
J. Organometal. Chem., 1968, 13, 87. [all data]