Butanenitrile, 2-methyl-
- Formula: C5H9N
- Molecular weight: 83.1317
- IUPAC Standard InChIKey: RCEJCSULJQNRQQ-UHFFFAOYSA-N
- CAS Registry Number: 18936-17-9
- Chemical structure:
View 3d structure (requires JavaScript / HTML 5) - Other names: 2-Cyanobutane; 2-Methylbutanenitrile; Butyronitrile, 2-methyl-; 2-Methylbutyronitrile; α-Methylbutyronitrile; 2-Methylbutylnitrile

Gas phase thermochemistry data

Data compiled by: Hussein Y. Afeefy, Joel F. Liebman, and Stephen E. Stein
Quantity | Value | Units | Method | Reference | Comment |
---|---|---|---|---|---|
ΔfH°gas | 2.4 ± 1.4 | kJ/mol | Ccr | Rakus, Verevkin, et al., 1994 |

Condensed phase thermochemistry data

Data compiled by: Hussein Y. Afeefy, Joel F. Liebman, and Stephen E. Stein
Quantity | Value | Units | Method | Reference | Comment |
---|---|---|---|---|---|
ΔfH°liquid | -40.03 | kJ/mol | Ccr | Rakus, Verevkin, et al., 1994 | |
Quantity | Value | Units | Method | Reference | Comment |
ΔcH°liquid | -3213.8 ± 1.4 | kJ/mol | Ccr | Rakus, Verevkin, et al., 1994 |

Phase change data

Data compiled as indicated in comments:
BS - Robert L. Brown and Stephen E. Stein
TRC - Thermodynamics Research Center, NIST Boulder Laboratories, Chris Muzny director
ALS - Hussein Y. Afeefy, Joel F. Liebman, and Stephen E. Stein
DRB - Donald R. Burgess, Jr.
AC - William E. Acree, Jr., James S. Chickos
Quantity | Value | Units | Method | Reference | Comment |
---|---|---|---|---|---|
Tboil | 398. ± 2. | K | AVG | N/A | Average of 10 values; Individual data points |
Quantity | Value | Units | Method | Reference | Comment |
ΔvapH° | 42.47 ± 0.29 | kJ/mol | V | Rakus, Verevkin, et al., 1994 | ALS |
ΔvapH° | 42.4 | kJ/mol | N/A | Rakus, Verevkin, et al., 1994 | DRB |
ΔvapH° | 40.60 ± 0.06 | kJ/mol | V | Howard and Wadso, 1970 | ALS |
Enthalpy of vaporization
ΔvapH (kJ/mol) | Temperature (K) | Method | Reference | Comment |
---|---|---|---|---|
42.5 ± 0.3 | 274. to 313. | GS | Rakus, Verevkin, et al., 1994 | AC |

Gas phase ion energetics data

Data compiled by: Sharon G. Lias, John E. Bartmess, Joel F. Liebman, John L. Holmes, Rhoda D. Levin, and W. Gary Mallard
Appearance energy determinations
Ion | AE (eV) | Other Products | Method | Reference | Comment |
---|---|---|---|---|---|
C3H5N+ | 11.5 ± 0.25 | C2H4 | EI | Chess, Lapp, et al., 1982 |

Normal alkane RI, non-polar column, custom temperature program

Column type | Active phase | I | Reference | Comment |
---|---|---|---|---|
Capillary | DB-5 MS | 717. | Cajka, Hajslova, et al., 2007 | 30. m/0.25 mm/0.25 μm, Helium; Program: 45 0C (0.75 min) 10 0C/min -> 200 0C 30 0C/min -> 245 0C (1.25 min) |
Capillary | DB-5 MS | 729. | Liu, Xu, et al., 2007 | 60. m/0.32 mm/1.0 μm, Helium; Program: 40 0C (2 min) 6 0C/min -> 100 0C 4 0C/min -> 180 0C 8 0C/min -> 250 0C (12 min) |

Normal alkane RI, polar column, temperature ramp

Column type | Active phase | I | Reference | Comment |
---|---|---|---|---|
Capillary | HP-Innowax | 1094. | Soria, Sanz, et al., 2008 | 50. m/0.20 mm/0.20 μm, Helium, 45. C @ 2. min, 4. K/min, 190. C @ 50. min |

Normal alkane RI, polar column, custom temperature program

Column type | Active phase | I | Reference | Comment |
---|---|---|---|---|
Capillary | Supelcowax 10 | 1091. | Soria, Martinez-Castro, et al., 2008 | 50. m/0.25 mm/0.25 μm, Helium; Program: 45 0C (15 min) 3 0C/min -> 75 0C 5 0C/min -> 180 0C (10 min) |
Capillary | Supelcowax 10 | 1091. | Soria, Martinez-Castro, et al., 2008 | 50. m/0.25 mm/0.25 μm, Helium; Program: 45 0C (15 min) 3 0C/min -> 75 0C 5 0C/min -> 180 0C (10 min) |

References

Rakus, Verevkin, et al., 1994
Rakus, K.; Verevkin, S.P.; Beckhaus, H.-D.; Rchardt, C.,
Thermochemistry and thermal decomposition of alkyl-substituted tricyanomethyl compounds,
Chem. Ber., 1994, 127, 2225-2234. [all data]
Howard and Wadso, 1970
Howard, P.B.; Wadso, I.,
Enthalpies of vaporization of organic compounds IV. Alkyl Nitriles,
Acta Chem. Scand., 1970, 24, 145. [all data]
Chess, Lapp, et al., 1982
Chess, E.K.; Lapp, R.L.; Gross, M.L.,
The question of tautomerism of alkylnitrile and isonitrile radical cations,
Org. Mass Spectrom., 1982, 17, 475. [all data]
Cajka, Hajslova, et al., 2007
Cajka, T.; Hajslova, J.; Cochran, J.; Holadova, K.; Klimankova, E.,
Solid phase microextraction - comprehensive two dimensional gas chromatography - time-of-flight mass spectrometry for the analysis of honey volatiles,
J. Sep. Sci., 2007, 30, 4, 534-546, https://doi.org/10.1002/jssc.200600413
. [all data]
Liu, Xu, et al., 2007
Liu, Y.; Xu, X.-L.; Zhou, G.-H.,
Comparative study of volatile compounds in traditional Chinese Nanjing marinated duck by different extraction techniques,
Int. J. Food Sci. Technol., 2007, 42, 5, 543-550, https://doi.org/10.1111/j.1365-2621.2006.01264.x
. [all data]
Soria, Sanz, et al., 2008
Soria, A.C.; Sanz, J.; Martinez-Castro, I.,
SPME followed by GC-MS: a powerful technique for qualitative analysis of honey volatiles,
Eur. Food Res. Technol., 2008, 1-12. [all data]
Soria, Martinez-Castro, et al., 2008
Soria, A.C.; Martinez-Castro, I.; Sanz, J.,
Some aspects of dynamic headspace analysis of volatile components in honey,
Foog Res. International, 2008, 41, 8, 838-848, https://doi.org/10.1016/j.foodres.2008.07.010
. [all data]