Formamide,N-(2-chloro-5-methylphenyl)-
- Formula: C8H8ClNO
- Molecular weight: 169.608
- IUPAC Standard InChIKey: TXIVLCTXAMZXGL-UHFFFAOYSA-N
- CAS Registry Number: 18931-82-3
- Chemical structure:
View 3d structure (requires JavaScript / HTML 5) - Permanent link for this species. Use this link for bookmarking this species for future reference.

Gas phase ion energetics data

Data compiled by: Sharon G. Lias, Rhoda D. Levin, and Sherif A. Kafafi
Ionization energy determinations
IE (eV) | Method | Reference |
---|---|---|
8.2 ± 0.1 | EI | Kuschel and Grutzmacher, 1974 |
Appearance energy determinations
Ion | AE (eV) | Other Products | Method | Reference | Comment |
---|---|---|---|---|---|
C8H8NO+ | 9.1 ± 0.1 | Cl | EI | Kuschel and Grutzmacher, 1974 |

References

Kuschel and Grutzmacher, 1974
Kuschel, H.; Grutzmacher, H.-F.,
Zum mechanismus massenspektrometrischer fragmentierungsreaktionen. XI. EinfluB von substituenten auf die bildung cyclischer fragment-ionen in den massenspektren von N,N-dimethyl-N'-2-chlorphenylformamidinen und 2-chlorformaniliden,
Org. Mass Spectrom., 1974, 9, 395. [all data]