Dibenzo[cd,lm]perylene
- Formula: C26H14
- Molecular weight: 326.3894
- IUPAC Standard InChIKey: WCXXBFNWCCIYQO-UHFFFAOYSA-N
- CAS Registry Number: 188-96-5
- Chemical structure:
View 3d structure (requires JavaScript / HTML 5) - Permanent link for this species. Use this link for bookmarking this species for future reference.

Gas phase thermochemistry data

Data compiled by: Glushko Thermocenter, Russian Academy of Sciences, Moscow
Constant pressure heat capacity of gas
Cp,gas (J/mol*K) | Temperature (K) | Reference | Comment |
---|---|---|---|
55.85 | 50. | Dorofeeva O.V., 1988 | Recommended values were calculated statistically mechanically using force field approximation for polycyclic aromatic hydrocarbons to estimate the needed vibrational frequencies (see also [ Dorofeeva O.V., 1986, Moiseeva N.F., 1989]). These functions are reproduced in the reference book [ Frenkel M., 1994]. |
97.14 | 100. | ||
148.04 | 150. | ||
204.99 | 200. | ||
292.09 | 273.15 | ||
321.5 ± 5.0 | 298.15 | ||
323.68 | 300. | ||
432.96 | 400. | ||
523.73 | 500. | ||
596.14 | 600. | ||
653.70 | 700. | ||
699.98 | 800. | ||
737.69 | 900. | ||
768.80 | 1000. | ||
794.73 | 1100. | ||
816.51 | 1200. | ||
834.94 | 1300. | ||
850.64 | 1400. | ||
864.09 | 1500. |

Gas phase ion energetics data

Data compiled as indicated in comments:
LLK - Sharon G. Lias, Rhoda D. Levin, and Sherif A. Kafafi
RDSH - Henry M. Rosenstock, Keith Draxl, Bruce W. Steiner, and John T. Herron
Ionization energy determinations
IE (eV) | Method | Reference | Comment |
---|---|---|---|
6.72 ± 0.02 | PE | Clar and Schmidt, 1978 | LLK |
6.77 ± 0.04 | PE | Boschi, Clar, et al., 1974 | LLK |
7.10 | CTS | Briegleb, 1964 | RDSH |
6.82 | CTS | Matsen, 1956 | RDSH |

References

Dorofeeva O.V., 1988
Dorofeeva O.V.,
Thermodynamic Properties of Polycyclic Aromatic Hydrocarbons in the Gaseous Phase. Institute for High Temperatures, USSR Academy of Sciences, Preprint No.1-238 (in Russian), Moscow, 1988. [all data]
Dorofeeva O.V., 1986
Dorofeeva O.V.,
On calculation of thermodynamic properties of polycyclic aromatic hydrocarbons,
Thermochim. Acta, 1986, 102, 59-66. [all data]
Moiseeva N.F., 1989
Moiseeva N.F.,
Development of Benson group additivity method for estimation of ideal gas thermodynamic properties of polycyclic aromatic hydrocarbons,
Thermochim. Acta, 1989, 153, 77-85. [all data]
Frenkel M., 1994
Frenkel M.,
Thermodynamics of Organic Compounds in the Gas State, Vol. I, II, Thermodynamics Research Center, College Station, Texas, 1994, 1994. [all data]
Clar and Schmidt, 1978
Clar, E.; Schmidt, W.,
Correlations between photoelectron and ultravioet absorption spectra of polycyclic hydrocarbons. The terrylene and peropyrene series,
Tetrahedron, 1978, 34, 3219. [all data]
Boschi, Clar, et al., 1974
Boschi, R.; Clar, E.; Schmidt, W.,
Photoelectron spectra of polynuclear aromatics. III. The effect of nonplanarity in sterically overcrowded aromatic hydrocarbons,
J. Chem. Phys., 1974, 60, 4406. [all data]
Briegleb, 1964
Briegleb, G.,
Electron affinity of organic molecules,
Angew. Chem. Intern. Ed., 1964, 3, 617. [all data]
Matsen, 1956
Matsen, F.A.,
Electron affinities, methyl affinities, and ionization energies of condensed ring aromatic hydrocarbons,
J. Chem. Phys., 1956, 24, 602. [all data]