N-Acetylcaprolactam
- Formula: C8H13NO2
- Molecular weight: 155.1943
- IUPAC Standard InChIKey: QISSLHPKTCLLDL-UHFFFAOYSA-N
- CAS Registry Number: 1888-91-1
- Chemical structure:
View 3d structure (requires JavaScript / HTML 5) - Other names: 1-Acetylhexahydro-2H-azepin-2-one; N-Acetyl-ε-caprolactam; 2H-Azepin-2-one, 1-acetylhexahydro-; N-Acetyl-6-caprolactam; Acetylcaprolactam; Acetylkaprolaktam; NSC 522408; N-acetylhexanelactam

Phase change data

Data compiled by: Robert L. Brown and Stephen E. Stein
Reduced pressure boiling point
Tboil (K) | Pressure (bar) | Reference |
---|---|---|
407.7 | 0.035 | Aldrich Chemical Company Inc., 1990 |
393. to 396. | 0.013 | Frinton Laboratories Inc., 1986 |

References

Aldrich Chemical Company Inc., 1990
Aldrich Chemical Company Inc.,
Catalog Handbook of Fine Chemicals, Aldrich Chemical Company, Inc., Milwaukee WI, 1990, 1. [all data]
Frinton Laboratories Inc., 1986
Frinton Laboratories Inc.,
Catalog Number 11, Frinton Laboratories Inc., Vineland, NJ, 1986, 99. [all data]
van der Want, 1952
van der Want, G.M.,
The structure of the reaction product of ε-caprolactam and phthalic anhydride,
Recl. Trav. Chim. Pays-Bas, 1952, 71, 1012-1016. [all data]