Dinaphtho[1,2,3-cd:1',2',3'-lm]perylene

Gas phase ion energetics data

Data compiled by: Sharon G. Lias, Rhoda D. Levin, and Sherif A. Kafafi

Ionization energy determinations

IE (eV) Method Reference Comment
6.42 ± 0.02PEClar and Schmidt, 1978Vertical value

References

Clar and Schmidt, 1978
Clar, E.; Schmidt, W., Correlations between photoelectron and ultravioet absorption spectra of polycyclic hydrocarbons. The terrylene and peropyrene series, Tetrahedron, 1978, 34, 3219. [all data]