2,5-Dicyanothiophene
- Formula: C6H2N2S
- Molecular weight: 134.158
- IUPAC Standard InChIKey: MYINLNBRJVGINA-UHFFFAOYSA-N
- CAS Registry Number: 18853-40-2
- Chemical structure:
View 3d structure (requires JavaScript / HTML 5) - Permanent link for this species. Use this link for bookmarking this species for future reference.

Gas phase ion energetics data

Data compiled as indicated in comments:
LBLHLM - Sharon G. Lias, John E. Bartmess, Joel F. Liebman, John L. Holmes, Rhoda D. Levin, and W. Gary Mallard
Ionization energy determinations
IE (eV) | Method | Reference | Comment |
---|---|---|---|
9.76 | PE | Bock and Roth, 1983 | Vertical value; LBLHLM |

References

Bock and Roth, 1983
Bock, H.; Roth, B.,
Radical ions. 49. Redox reactions of some thiophene derivatives,
Phosphorus Sulfur, 1983, 14, 211. [all data]