Dibenzo[c,g]phenanthrene
- Formula: C22H14
- Molecular weight: 278.3466
- IUPAC Standard InChIKey: JKPCLJPYZMKPHM-UHFFFAOYSA-N
- CAS Registry Number: 188-52-3
- Chemical structure:
View 3d structure (requires JavaScript / HTML 5) - Other names: Pentahelicene

Gas phase ion energetics data

Data compiled by: Sharon G. Lias, Rhoda D. Levin, and Sherif A. Kafafi
Ionization energy determinations
IE (eV) | Method | Reference | Comment |
---|---|---|---|
7.51 ± 0.02 | PE | Schmidt, 1977 | |
7.47 | PE | Clar and Schmidt, 1975 | |
7.47 ± 0.04 | PE | Boschi, Clar, et al., 1974 | |
7.51 | PE | Clar and Schmidt, 1976 | Vertical value |
7.51 | PE | Obenland and Schmidt, 1975 | Vertical value |

Normal alkane RI, non-polar column, isothermal

Column type | Active phase | Temperature (C) | I | Reference | Comment |
---|---|---|---|---|---|
Packed | OV-1 | 230. | 2820. | Nicoud, Balavoine, et al., 1972 | Nitrogen, Gas-Chrom Q |
Packed | OV-1 | 250. | 2841. | Nicoud, Balavoine, et al., 1972 | Nitrogen, Gas-Chrom Q |
Packed | OV-1 | 230. | 2820. | Nicoud, Moradpour, et al., 1972 | Nitrogen, Gas-Chrom Q (60-80 mesh); Column length: 4. m |
Packed | OV-1 | 250. | 2841. | Nicoud, Moradpour, et al., 1972 | Nitrogen, Gas-Chrom Q (60-80 mesh); Column length: 4. m |

Lee's RI, non-polar column, custom temperature program

Column type | Active phase | I | Reference | Comment |
---|---|---|---|---|
Capillary | SE-54 | 465.39 | Guillen, Iglesias, et al., 1992 | Program: not specified |

References

Schmidt, 1977
Schmidt, W.,
Photoelectron spectra of polynuclear aromatics. V. Correlations with ultraviolet absorption spectra in the catacondensed series,
J. Chem. Phys., 1977, 66, 828. [all data]
Clar and Schmidt, 1975
Clar, E.; Schmidt, W.,
Correlations btween photoelectron and ultraviolet absorption spectra of polycyclic hydrocarbons and the number of aromatic sextets,
Tetrahedron, 1975, 31, 2263. [all data]
Boschi, Clar, et al., 1974
Boschi, R.; Clar, E.; Schmidt, W.,
Photoelectron spectra of polynuclear aromatics. III. The effect of nonplanarity in sterically overcrowded aromatic hydrocarbons,
J. Chem. Phys., 1974, 60, 4406. [all data]
Clar and Schmidt, 1976
Clar, E.; Schmidt, W.,
Correlations between photoelectron and phosphorescence spectra of polycyclic hydrocarbons,
Tetrahedron, 1976, 32, 2563. [all data]
Obenland and Schmidt, 1975
Obenland, S.; Schmidt, W.,
Photoelectron spectra of polynuclear aromatics. IV. The helicenes,
J. Am. Chem. Soc., 1975, 97, 6633. [all data]
Clar and Steward, 1952
Clar, E.; Steward, D.G.,
J. Am. Chem.Soc., 1952, 74, 6235. [all data]
Nicoud, Balavoine, et al., 1972
Nicoud, J.F.; Balavoine, G.; Kagan, H.; Martin, R.H.; Deblecker, M.,
Chromatographie en phase vapeur d'helicenes et de diaryl-1,2-ethylenes,
J. Chromatogr., 1972, 66, 1, 43-53, https://doi.org/10.1016/S0021-9673(01)82926-5
. [all data]
Nicoud, Moradpour, et al., 1972
Nicoud, J.F.; Moradpour, A.; Balavoine, G.; Kagan, H.; Martin, R.H.; Deblecker, M.,
Chromatographie en phase vapeur d'helicenes et de diaryl-1,2 ethylenes,
J. Chromatogr., 1972, 66, 1, 43-53, https://doi.org/10.1016/S0021-9673(01)82926-5
. [all data]
Guillen, Iglesias, et al., 1992
Guillen, M.D.; Iglesias, M.J.; Dominguez, A.; Blanco, C.G.,
Polynuclear aromatic hydrocarbon retention indices on SE-54 stationary phase of the volatile components of a coal tar pitch. Relationships between chromatographic retention and thermal reactivity,
J. Chromatogr., 1992, 591, 1-2, 287-295, https://doi.org/10.1016/0021-9673(92)80246-Q
. [all data]