Naphthaceno[2,1,12,11-opqra]naphthacene
- Formula: C30H16
- Molecular weight: 376.4480
- IUPAC Standard InChIKey: AHVOGQHPOOFLNU-UHFFFAOYSA-N
- CAS Registry Number: 188-42-1
- Chemical structure:
View 3d structure (requires JavaScript / HTML 5) - Permanent link for this species. Use this link for bookmarking this species for future reference.

Gas phase ion energetics data

Data compiled by: Henry M. Rosenstock, Keith Draxl, Bruce W. Steiner, and John T. Herron
Ionization energy determinations
IE (eV) | Method | Reference |
---|---|---|
6.58 | CTS | Briegleb, 1964 |
6.19 | CTS | Matsen, 1956 |

References

Briegleb, 1964
Briegleb, G.,
Electron affinity of organic molecules,
Angew. Chem. Intern. Ed., 1964, 3, 617. [all data]
Matsen, 1956
Matsen, F.A.,
Electron affinities, methyl affinities, and ionization energies of condensed ring aromatic hydrocarbons,
J. Chem. Phys., 1956, 24, 602. [all data]