Acetamide,N-(2,6-dimethylphenyl)-N-methyl-
- Formula: C11H15NO
- Molecular weight: 177.2429
- IUPAC Standard InChIKey: FPQRDECXMGHKJX-UHFFFAOYSA-N
- CAS Registry Number: 18835-47-7
- Chemical structure:
View 3d structure (requires JavaScript / HTML 5) - Permanent link for this species. Use this link for bookmarking this species for future reference.

Gas phase ion energetics data

Data compiled by: Sharon G. Lias, Rhoda D. Levin, and Sherif A. Kafafi
Ionization energy determinations
IE (eV) | Method | Reference | Comment |
---|---|---|---|
8.8 | PE | Nakagaki, Kobayashi, et al., 1980 | Vertical value |

References

Nakagaki, Kobayashi, et al., 1980
Nakagaki, R.; Kobayashi, T.; Nagakura, S.,
Conformations of acetanilide and related compounds studied by ultraviolet photoelectron spectroscopy,
Bull. Chem. Soc. Jpn., 1980, 53, 901. [all data]