Isopropryl mercuric bromide
- Formula: C3H7BrHg
- Molecular weight: 323.58
- CAS Registry Number: 18819-83-5

Condensed phase thermochemistry data

Data compiled by: José A. Martinho Simões
Quantity | Value | Units | Method | Reference | Comment |
---|---|---|---|---|---|
ΔfH°solid | -32.86 ± 0.79 | kcal/mol | Review | Martinho Simões | The enthalpy of formation relies on -4.0 ± 1.4 kcal/mol for the enthalpy of formation of Hg(i-Pr)2(l). |

Gas phase ion energetics data

Data compiled by: Sharon G. Lias and Joel F. Liebman
Ionization energy determinations
IE (eV) | Method | Reference |
---|---|---|
9.2 ± 0.2 | PI | Nekrasov, Zagorevskii, et al., 1992 |
Appearance energy determinations
Ion | AE (eV) | Other Products | Method | Reference | Comment |
---|---|---|---|---|---|
C2H4BrHg+ | 10. ± 0.2 | CH3 | PI | Nekrasov, Zagorevskii, et al., 1992 |

References

Martinho Simões
Martinho Simões, J.A.,
Private communication (see http://webbook.nist.gov/chemistry/om/). [all data]
Nekrasov, Zagorevskii, et al., 1992
Nekrasov, Y.S.; Zagorevskii, D.V.; Mikeladze, M.S.,
Mass spectrometry of organomercury compounds,
Organomet. Chem. USSR, 1992, 5, 237, In original 499. [all data]