Dibenzo[fg,ij]phenanthro[9,10,1,2,3-pqrst]pentaphene
- Formula: C36H18
- Molecular weight: 450.5281
- IUPAC Standard InChIKey: PIOIXLTVQRSBRZ-UHFFFAOYSA-N
- CAS Registry Number: 188-00-1
- Chemical structure:
View 3d structure (requires JavaScript / HTML 5) - Permanent link for this species. Use this link for bookmarking this species for future reference.

Gas phase ion energetics data

Data compiled by: Sharon G. Lias, Rhoda D. Levin, and Sherif A. Kafafi
Ionization energy determinations
IE (eV) | Method | Reference | Comment |
---|---|---|---|
7.10 | PE | Clar and Schmidt, 1976 | Vertical value |

References

Clar and Schmidt, 1976
Clar, E.; Schmidt, W.,
Correlations between photoelectron and phosphorescence spectra of polycyclic hydrocarbons,
Tetrahedron, 1976, 32, 2563. [all data]