Benzene, 1-methoxy-4-(methylthio)-
- Formula: C8H10OS
- Molecular weight: 154.229
- IUPAC Standard InChIKey: DQNSKXYRRRCKGH-UHFFFAOYSA-N
- CAS Registry Number: 1879-16-9
- Chemical structure:
View 3d structure (requires JavaScript / HTML 5) - Other names: Anisole, p-(methylthio)-; p-(Methylthio)anisole; p-Anisyl methyl sulfide; p-Methoxyphenyl methyl sulfide; Methyl p-methoxyphenyl sulfide; Methyl 4-methoxyphenyl sulfide; 1-Methoxy-4-methylthiobenzene; 4-(Methylthio)anisole; 4-Methoxythiophenol, S-methyl-; Methyl p-anisyl sulfide; NSC 124839; 1-Methoxy-4-(methylsulfanyl)benzene

Gas phase ion energetics data

Data compiled as indicated in comments:
LLK - Sharon G. Lias, Rhoda D. Levin, and Sherif A. Kafafi
Ionization energy determinations
IE (eV) | Method | Reference | Comment |
---|---|---|---|
7.80 | PE | Chmutova, Vtyurina, et al., 1979 | Vertical value; LLK |
7.80 ± 0.01 | PE | Bernardi, Distefano, et al., 1975 | Vertical value; LLK |

Van Den Dool and Kratz RI, non-polar column, custom temperature program

Column type | Active phase | I | Reference | Comment |
---|---|---|---|---|
Capillary | VF-5MS | 1355.7 | Tret'yakov, 2008 | 30. m/0.25 mm/0.25 μm, He; Program: Multi-step temperature program; T(initial)=60C; T(final)=270C |

References

Chmutova, Vtyurina, et al., 1979
Chmutova, G.A.; Vtyurina, N.N.; Komina, T.V.; Gazizov, I.G.; Bock, H.,
Molecular-orbital characteristics of anisole isologs X-C6H4-ECH3 (E = O, S, Se) containing donor substituents X,
Zh. Obshch. Khim., 1979, 49, 192. [all data]
Bernardi, Distefano, et al., 1975
Bernardi, F.; Distefano, G.; Mangini, A.; Pignataro, S.; Spunta, G.,
Photoelectron spectra of substituted anisoles thioanisoles,
J. Electron Spectrosc. Relat. Phenom., 1975, 7, 457. [all data]
Bermingham and Smith, 1972
Bermingham, G.E.; Smith, N.H.P.,
Spectrochim. Acta, 1972, 28 A, 1415. [all data]
Tret'yakov, 2008
Tret'yakov, K.V.,
Retention Data. NIST Mass Spectrometry Data Center., NIST Mass Spectrometry Data Center, 2008. [all data]