Silane,dimethyl-di-1-naphthalenyl-
- Formula: C22H20Si
- Molecular weight: 312.4797
- IUPAC Standard InChIKey: SHCZBMYTPGCRGJ-UHFFFAOYSA-N
- CAS Registry Number: 18753-19-0
- Chemical structure:
View 3d structure (requires JavaScript / HTML 5) - Permanent link for this species. Use this link for bookmarking this species for future reference.

Gas phase ion energetics data

Data compiled by: Sharon G. Lias, Rhoda D. Levin, and Sherif A. Kafafi
Ionization energy determinations
IE (eV) | Method | Reference |
---|---|---|
8.03 | CTS | Pitt, Carey, et al., 1972 |

References

Pitt, Carey, et al., 1972
Pitt, C.G.; Carey, R.N.; Toren, E.C.,
Nature of the electronic interactions in aryl-substituted polysilanes,
J. Am. Chem. Soc., 1972, 94, 3806. [all data]