cis-Chlorfenvinphos
- Formula: C12H14Cl3O4P
- Molecular weight: 359.570
- IUPAC Standard InChIKey: FSAVDKDHPDSCTO-WQLSENKSSA-N
- CAS Registry Number: 18708-87-7
- Chemical structure:
View 3d structure (requires JavaScript / HTML 5) - Stereoisomers:
- Other names: Phosphoric acid, 2-chloro-1-(2,4-dichlorophenyl)ethenyl diethyl ester, (Z)-; Phosphoric acid, 2-chloro-1-(2,4-dichlorophenyl)vinyl diethyl ester, (Z)-; cis-Isomer of chlorfenvinphos; Chlorfenvinphos (cis); β-Chlorfenvinphos; Chlorfenvinphos, β-; (Z)-2-Chloro-1-(2,4-dichlorophenyl)ethenyl diethyl phosphate; (Z)-Chlorfenvinfos; (Z)-Chlorfenvinphos; Chlorfenvinphos Z; Chlorfenvinphos (Z), β

Normal alkane RI, non-polar column, custom temperature program

Column type | Active phase | I | Reference | Comment |
---|---|---|---|---|
Capillary | 5 % Phenyl methyl siloxane | 2069. | Department of Food Safety and Welfare, 2006 | 30. m/0.25 mm/0.25 μm, Helium; Program: 50 0C(1 min) 25 0C/min -> 125 0C 10 0C/min -> 300 0C (10 min) |
Capillary | 5 % Phenyl methyl siloxane | 2071. | Department of Food Safety and Welfare, 2006 | 30. m/0.25 mm/0.25 μm, Helium; Program: 50 0C(1 min) 25 0C/min -> 125 0C 10 0C/min -> 300 0C (10 min) |

References

Department of Food Safety and Welfare, 2006
Department of Food Safety, Ministry of Health; Welfare,
Analytical methods for residual compositional substances of agricultural chemicals, feed aadditives, and veterinary drugs in foods, 2006, retrieved from http://www.mhlw.go.jp/english/topics/foodsafety/positivelist060228/de/060526-1a.pdf. [all data]