Bicyclo[2.2.0]hexane
- Formula: C6H10
- Molecular weight: 82.1436
- IUPAC Standard InChIKey: YZLCEXRVQZNGEK-UHFFFAOYSA-N
- CAS Registry Number: 186-04-9
- Chemical structure:
View 3d structure (requires JavaScript / HTML 5) - Permanent link for this species. Use this link for bookmarking this species for future reference.

Gas phase thermochemistry data

Data compiled by: Hussein Y. Afeefy, Joel F. Liebman, and Stephen E. Stein
Quantity | Value | Units | Method | Reference | Comment |
---|---|---|---|---|---|
ΔfH°gas | 125. | kJ/mol | Chyd | Roth, Adamczak, et al., 1991 |

Phase change data

Data compiled by: Robert L. Brown and Stephen E. Stein
Quantity | Value | Units | Method | Reference | Comment |
---|---|---|---|---|---|
Tboil | 353. | K | N/A | Buckingham and Donaghy, 1982 |

Gas phase ion energetics data

Data compiled by: Sharon G. Lias, Rhoda D. Levin, and Sherif A. Kafafi
Ionization energy determinations
IE (eV) | Method | Reference | Comment |
---|---|---|---|
9.0 ± 0.1 | PE | Bieri, Burger, et al., 1977 | |
9.6 ± 0.1 | PE | Bieri, Burger, et al., 1977 | Vertical value |
9.6 | PE | Bieri, Heilbronner, et al., 1976 | Vertical value |

References

Roth, Adamczak, et al., 1991
Roth, W.R.; Adamczak, O.; Breuckmann, R.; Lennartz, H.-W.; Boese, R.,
Die Berechnung von Resonanzenergien; das MM2ERW-Kraftfeld,
Chem. Ber., 1991, 124, 2499-2521. [all data]
Buckingham and Donaghy, 1982
Buckingham, J.; Donaghy, S.M.,
Dictionary of Organic Compounds: Fifth Edition, Chapman and Hall, New York, 1982, 1. [all data]
Bieri, Burger, et al., 1977
Bieri, G.; Burger, F.; Heilbronner, E.; Maier, J.P.,
Valence ionization enrgies of hydrocarbons,
Helv. Chim. Acta, 1977, 60, 2213. [all data]
Bieri, Heilbronner, et al., 1976
Bieri, G.; Heilbronner, E.; Kobayashi, T.; Schmelzer, A.; Goldstein, M.J.; Leight, R.S.; Lipton, M.S.,
286. Dewar benzene some of its derivatives. A photoelectron spectroscopic analysis,
Helv. Chim. Acta, 1976, 59, 2657. [all data]