Bicyclo[2.1.0]pentane
- Formula: C5H8
- Molecular weight: 68.1170
- IUPAC Standard InChIKey: MHLPKAGDPWUOOT-UHFFFAOYSA-N
- CAS Registry Number: 185-94-4
- Chemical structure:
View 3d structure (requires JavaScript / HTML 5) - Permanent link for this species. Use this link for bookmarking this species for future reference.

Gas phase thermochemistry data

Data compiled by: Hussein Y. Afeefy, Joel F. Liebman, and Stephen E. Stein
Quantity | Value | Units | Method | Reference | Comment |
---|---|---|---|---|---|
ΔfH°gas | 158. | kJ/mol | Chyd | Roth, Adamczak, et al., 1991 |

Phase change data

Data compiled as indicated in comments:
BS - Robert L. Brown and Stephen E. Stein
AC - William E. Acree, Jr., James S. Chickos
Quantity | Value | Units | Method | Reference | Comment |
---|---|---|---|---|---|
Tboil | 318.6 | K | N/A | Buckingham and Donaghy, 1982 | BS |
Quantity | Value | Units | Method | Reference | Comment |
ΔvapH° | 28.0 ± 0.5 | kJ/mol | EB | Kolesov, Pimenova, et al., 1998 | See also Varushchenko, Pashchenko, et al., 1996.; AC |
Enthalpy of vaporization
ΔvapH (kJ/mol) | Temperature (K) | Method | Reference | Comment |
---|---|---|---|---|
28.6 | 305. | A | Stephenson and Malanowski, 1987 | Based on data from 296. to 315. K.; AC |

Reaction thermochemistry data

Data compiled by: Hussein Y. Afeefy, Joel F. Liebman, and Stephen E. Stein
Individual Reactions
Quantity | Value | Units | Method | Reference | Comment |
---|---|---|---|---|---|
ΔrH° | -235. ± 0.4 | kJ/mol | Chyd | Roth, Klarner, et al., 1980 | liquid phase; solvent: Heptane |
ΔrH° | -230.7 ± 1.5 | kJ/mol | Chyd | Turner, Goebel, et al., 1968 | liquid phase; solvent: Acetic acid |
By formula: C5H8N2 = C5H8 + N2
Quantity | Value | Units | Method | Reference | Comment |
---|---|---|---|---|---|
ΔrH° | -22. ± 10. | kJ/mol | Cpha | Herman and Goodman, 1989 | solid phase; solvent: Acetonitrile/water |

Gas phase ion energetics data

Data compiled by: Sharon G. Lias, Rhoda D. Levin, and Sherif A. Kafafi
Ionization energy determinations
IE (eV) | Method | Reference | Comment |
---|---|---|---|
8.7 ± 0.1 | PE | Bieri, Burger, et al., 1977 | |
9.5 ± 0.1 | PE | Bieri, Burger, et al., 1977 | Vertical value |

References

Roth, Adamczak, et al., 1991
Roth, W.R.; Adamczak, O.; Breuckmann, R.; Lennartz, H.-W.; Boese, R.,
Die Berechnung von Resonanzenergien; das MM2ERW-Kraftfeld,
Chem. Ber., 1991, 124, 2499-2521. [all data]
Buckingham and Donaghy, 1982
Buckingham, J.; Donaghy, S.M.,
Dictionary of Organic Compounds: Fifth Edition, Chapman and Hall, New York, 1982, 1. [all data]
Kolesov, Pimenova, et al., 1998
Kolesov, V.P.; Pimenova, S.M.; Lukyanova, V.A.; Kuznetsova, T.S.; Kozina, M.P.,
The thermochemistry of some polycyclic compounds,
The Journal of Chemical Thermodynamics, 1998, 30, 12, 1455-1464, https://doi.org/10.1006/jcht.1998.0413
. [all data]
Varushchenko, Pashchenko, et al., 1996
Varushchenko, R.M.; Pashchenko, L.L.; Druzhinina, A.I.,
Enthalpies of vaporization of some mono- and polycyclic hydrocarbons,
Zh. Fiz. Khim., 1996, 70, 2, 228. [all data]
Stephenson and Malanowski, 1987
Stephenson, Richard M.; Malanowski, Stanislaw,
Handbook of the Thermodynamics of Organic Compounds, 1987, https://doi.org/10.1007/978-94-009-3173-2
. [all data]
Roth, Klarner, et al., 1980
Roth, W.R.; Klarner, F.-G.; Lennartz, H.-W.,
Heats of hydrogenation. II. Heat of hydrogenation of bicyclo[2.1.0]pent-2-ene, an antiaromatic system,
Chem. Ber., 1980, 113, 1806-1818. [all data]
Turner, Goebel, et al., 1968
Turner, R.B.; Goebel, P.; Mallon, B.J.; Doering, W.E.; Coburn, J.F., Jr.; Pomerantz, M.,
Heats of hydrogenation. VIII. Compounds with three- and four-membered rings,
J. Am. Chem. Soc., 1968, 90, 4315-4322. [all data]
Herman and Goodman, 1989
Herman, M.S.; Goodman, J.L.,
Determination of the enthalpy and reaction volume changes of organic photoreactions using photoacoustic calorimetry,
J. Am. Chem. Soc., 1989, 111, 1849-1854. [all data]
Bieri, Burger, et al., 1977
Bieri, G.; Burger, F.; Heilbronner, E.; Maier, J.P.,
Valence ionization enrgies of hydrocarbons,
Helv. Chim. Acta, 1977, 60, 2213. [all data]