1,3-Dithietane-2-thione
- Formula: C2H2S3
- Molecular weight: 122.232
- IUPAC Standard InChIKey: AOILGVJZQNPLBX-UHFFFAOYSA-N
- CAS Registry Number: 18555-26-5
- Chemical structure:
View 3d structure (requires JavaScript / HTML 5) - Permanent link for this species. Use this link for bookmarking this species for future reference.

Gas phase ion energetics data

Data compiled by: Sharon G. Lias, Rhoda D. Levin, and Sherif A. Kafafi
Ionization energy determinations
IE (eV) | Method | Reference | Comment |
---|---|---|---|
8.83 | PE | Wittel, Astrup, et al., 1975 | Vertical value |

References

Wittel, Astrup, et al., 1975
Wittel, K.; Astrup, E.E.; Bock, H.; Graeffe, G.; Juslen, H.,
Photoelectron spectra and molecular properties, XLVIII Carbonates thio- carbonates,
Z. Naturforsch. B:, 1975, 30, 862. [all data]