9-Thia-10-silaanthracene 9,9-dioxide, 10,10-dimethyl-
- Formula: C14H14O2SSi
- Molecular weight: 274.410
- IUPAC Standard InChIKey: PXZZDSBQCGFIIG-UHFFFAOYSA-N
- CAS Registry Number: 18551-82-1
- Chemical structure:
View 3d structure (requires JavaScript / HTML 5) - Permanent link for this species. Use this link for bookmarking this species for future reference.

Gas phase ion energetics data

Data compiled by: Sharon G. Lias, Rhoda D. Levin, and Sherif A. Kafafi
Ionization energy determinations
IE (eV) | Method | Reference | Comment |
---|---|---|---|
9.0 | PE | Traven', Redchenko, et al., 1981 | |
9.28 | PE | Traven', Redchenko, et al., 1981 | Vertical value |

References

Traven', Redchenko, et al., 1981
Traven', V.F.; Redchenko, V.V.; Eismont, M.Y.; Stepanov, B.I.,
Photoelectron spectra and electronic and steric structures of silicon and sulfur-containing analogs of 9,10-dihydroanthracene,
J. Gen. Chem. USSR, 1981, 51, 1099, In original 1297. [all data]