Tetramethyl orthocarbonate
- Formula: C5H12O4
- Molecular weight: 136.1464
- IUPAC Standard InChIKey: AHJWSRRHTXRLAQ-UHFFFAOYSA-N
- CAS Registry Number: 1850-14-2
- Chemical structure:
View 3d structure (requires JavaScript / HTML 5) - Other names: Tetramethoxymethane; Methane, tetramethoxy-

Gas phase thermochemistry data

Data compiled by: Hussein Y. Afeefy, Joel F. Liebman, and Stephen E. Stein
Quantity | Value | Units | Method | Reference | Comment |
---|---|---|---|---|---|
ΔfH°gas | -727.2 ± 1.5 | kJ/mol | Cm | Wiberg and Squires, 1979 | Hydrolysis |
ΔfH°gas | -727.6 | kJ/mol | Cm | Hine and Klueppet, 1974 |

Condensed phase thermochemistry data

Data compiled by: Hussein Y. Afeefy, Joel F. Liebman, and Stephen E. Stein
Quantity | Value | Units | Method | Reference | Comment |
---|---|---|---|---|---|
ΔfH°liquid | -767.1 ± 1.3 | kJ/mol | Cm | Wiberg and Squires, 1979 | Hydrolysis |
ΔfH°liquid | -767.3 | kJ/mol | Cm | Hine and Klueppet, 1974 |

Phase change data

Data compiled as indicated in comments:
BS - Robert L. Brown and Stephen E. Stein
ALS - Hussein Y. Afeefy, Joel F. Liebman, and Stephen E. Stein
DRB - Donald R. Burgess, Jr.
AC - William E. Acree, Jr., James S. Chickos
Quantity | Value | Units | Method | Reference | Comment |
---|---|---|---|---|---|
Tboil | 387.2 | K | N/A | Weast and Grasselli, 1989 | BS |
Quantity | Value | Units | Method | Reference | Comment |
ΔvapH° | 39.99 ± 0.75 | kJ/mol | E | Wiberg and Squires, 1979 | Hydrolysis; ALS |
ΔvapH° | 39.9 | kJ/mol | N/A | Wiberg and Squires, 1979 | DRB |
ΔvapH° | 40.0 | kJ/mol | V | Hine and Klueppet, 1974 | ALS |
ΔvapH° | 39.7 | kJ/mol | N/A | Hine and Klueppet, 1974 | DRB |
Enthalpy of vaporization
ΔvapH (kJ/mol) | Temperature (K) | Reference | Comment |
---|---|---|---|
41.2 | 319. | Thomas, Smith, et al., 2007 | Based on data from 304. to 387. K.; AC |

Reaction thermochemistry data

Data compiled by: Hussein Y. Afeefy, Joel F. Liebman, and Stephen E. Stein
Individual Reactions
By formula: C5H12O4 + H2O = C3H6O3 + 2CH4O
Quantity | Value | Units | Method | Reference | Comment |
---|---|---|---|---|---|
ΔrH° | 31.47 ± 0.046 | kJ/mol | Cm | Wiberg, 1980 | liquid phase; solvent: Water; Hydroysis |
ΔrH° | -31.466 ± 0.044 | kJ/mol | Cm | Wiberg and Squires, 1979 | liquid phase; solvent: Water; Hydrolysis |
ΔrH° | -31.1 ± 1.7 | kJ/mol | Cm | Hine and Klueppet, 1974 | liquid phase |

Gas phase ion energetics data

Data compiled by: Henry M. Rosenstock, Keith Draxl, Bruce W. Steiner, and John T. Herron
Appearance energy determinations
Ion | AE (eV) | Other Products | Method | Reference | Comment |
---|---|---|---|---|---|
C4H9O3+ | 10.32 ± 0.10 | CH3O | EI | Martin, Lampe, et al., 1966 |

Kovats' RI, non-polar column, isothermal

Column type | Active phase | Temperature (C) | I | Reference | Comment |
---|---|---|---|---|---|
Packed | Apiezon L | 120. | 826. | Bogoslovsky, Anvaer, et al., 1978 | Celite 545 |
Packed | Apiezon L | 160. | 833. | Bogoslovsky, Anvaer, et al., 1978 | Celite 545 |

References

Wiberg and Squires, 1979
Wiberg, K.B.; Squires, R.R.,
A microprocessor-controlled system for precise measurement of temperature changes. Determination of the enthalpies of hydrolysis of some polyoxygenated hydrocarbons,
J. Chem. Thermodyn., 1979, 11, 773-786. [all data]
Hine and Klueppet, 1974
Hine, J.; Klueppet, A.W.,
Structural effects on rates and equilibria. XVIII. Thermodynamic stability of ortho esters,
J. Am. Chem. Soc., 1974, 96, 2924-2929. [all data]
Weast and Grasselli, 1989
CRC Handbook of Data on Organic Compounds, 2nd Editon, Weast,R.C and Grasselli, J.G., ed(s)., CRC Press, Inc., Boca Raton, FL, 1989, 1. [all data]
Thomas, Smith, et al., 2007
Thomas, Leo H.; Smith, Harry; Davies, Gwyn H.,
Vapour pressures, molar entropies of vaporisation and liquid-state conformation of alkoxides,
J. Chem. Technol. Biotechnol., 2007, 30, 1, 476-480, https://doi.org/10.1002/jctb.503300160
. [all data]
Wiberg, 1980
Wiberg, K.B.,
Energies of organic compounds,
Rept. DOE-E(11-1)4060 Prepared for US Dept. of Energy by Yale Univ., New Haven, CT. Avail. NTIS, 1980, 1-24. [all data]
Martin, Lampe, et al., 1966
Martin, R.H.; Lampe, F.W.; Taft, R.W.,
An electron-impact study of ionization and dissociation in methoxy- and halogen- substituted methanes,
J. Am. Chem. Soc., 1966, 88, 1353. [all data]
Bogoslovsky, Anvaer, et al., 1978
Bogoslovsky, Yu.N.; Anvaer, B.I.; Vigdergauz, M.S.,
Chromatographic constants in gas chromatography (in Russian), Standards Publ. House, Moscow, 1978, 192. [all data]