Phenol, 2,4-bis(1-methylpropyl)-
- Formula: C14H22O
- Molecular weight: 206.3239
- IUPAC Standard InChIKey: JERZAOOJWPHIDG-UHFFFAOYSA-N
- CAS Registry Number: 1849-18-9
- Chemical structure:
View 3d structure (requires JavaScript / HTML 5) - Other names: Phenol, 2,4-di-sec-butyl-; 2,4-Di-sec-butylphenol

Reaction thermochemistry data

Data compiled by: Hussein Y. Afeefy, Joel F. Liebman, and Stephen E. Stein
Individual Reactions
+ C18H30O =
+
By formula: C6H6O + C18H30O = C14H22O + C10H14O
Quantity | Value | Units | Method | Reference | Comment |
---|---|---|---|---|---|
ΔrH° | -1.7 ± 1.5 | kJ/mol | Eqk | Nesterova, Pimerzin, et al., 1989 | liquid phase; Isomerization |
By formula: C6H6O + C14H22O = C10H14O + C10H14O
Quantity | Value | Units | Method | Reference | Comment |
---|---|---|---|---|---|
ΔrH° | -3.2 ± 1.9 | kJ/mol | Eqk | Nesterova, Pimerzin, et al., 1989 | liquid phase; Isomerization |
By formula: C14H22O = C14H22O
Quantity | Value | Units | Method | Reference | Comment |
---|---|---|---|---|---|
ΔrH° | -3.5 ± 1.9 | kJ/mol | Eqk | Nesterova, Pimerzin, et al., 1989 | liquid phase; Isomerization |

References

Nesterova, Pimerzin, et al., 1989
Nesterova, T.N.; Pimerzin, A.A.; Rozhnov, A.M.; Karlina, T.N.,
Equilibria for the isomerization of (secondary-alkyl)phenols and cyclohexylphenols,
J. Chem. Thermodyn., 1989, 21, 385-395. [all data]