Iron, dibromotetracarbonyl-

Gas phase ion energetics data

Data compiled by: Sharon G. Lias, Rhoda D. Levin, and Sherif A. Kafafi

Ionization energy determinations

IE (eV) Method Reference Comment
8.68PELevenson, Cihonski, et al., 1975Vertical value

References

Levenson, Cihonski, et al., 1975
Levenson, R.A.; Cihonski, J.L.; Milazzo, P.; Ceasar, G.P., Photoelectron spectra of Fe(CO)4X2 (X = Br,I). Transition metal analogs of the methylene halides, Inorg. Chem., 1975, 14, 2578. [all data]