Tungsten,pentacarbonyl(tricyclohexylphosphine)-

Gas phase ion energetics data

Data compiled by: Sharon G. Lias, Rhoda D. Levin, and Sherif A. Kafafi

Ionization energy determinations

IE (eV) Method Reference Comment
7.29PEDaamen, Oskam, et al., 1980Vertical value

References

Daamen, Oskam, et al., 1980
Daamen, H.; Oskam, A.; Stufkens, D.J., U.V. photoelectron (He I and He II) studies of M(CO)5PR3 (M = Cr, W and R = C6H11, C6H5, O-i-C3H7, OC6H5) and W(CO)5As(C6H5)3, Inorg. Chim. Acta, 1980, 38, 71. [all data]