N,N-Dimethyl p-bromobenzamide
- Formula: C9H10BrNO
- Molecular weight: 228.086
- IUPAC Standard InChIKey: BRRVYBRXLUEEJP-UHFFFAOYSA-N
- CAS Registry Number: 18469-37-9
- Chemical structure:
View 3d structure (requires JavaScript / HTML 5) - Permanent link for this species. Use this link for bookmarking this species for future reference.

Gas phase ion energetics data

Data compiled as indicated in comments:
LBLHLM - Sharon G. Lias, John E. Bartmess, Joel F. Liebman, John L. Holmes, Rhoda D. Levin, and W. Gary Mallard
Ionization energy determinations
IE (eV) | Method | Reference | Comment |
---|---|---|---|
9.09 | PE | Gal, Geribaldi, et al., 1985 | Vertical value; LBLHLM |

References

Gal, Geribaldi, et al., 1985
Gal, J.-F.; Geribaldi, S.; Pfister-Guillouzo, G.; Morris, D.G.,
Basicity of the carbonyl group. Part 12. Correlations between ionization potentials and lewis basicities in aromatic carbonyl compounds,
J. Chem. Soc. Perkin Trans. 2, 1985, 103. [all data]