Manganese, dodecacarbonyltrihydrotri-, triangulo
- Formula: C12H3Mn3O12
- Molecular weight: 503.9592
- IUPAC Standard InChIKey: OCWLFXIGUYHJQQ-UHFFFAOYSA-N
- CAS Registry Number: 18444-56-9
- Chemical structure:

Gas phase ion energetics data

Data compiled by: Sharon G. Lias, Rhoda D. Levin, and Sherif A. Kafafi
Ionization energy determinations
IE (eV) | Method | Reference |
---|---|---|
7.9 | PE | Wong, Dutta, et al., 1981 |

References

Wong, Dutta, et al., 1981
Wong, K.S.; Dutta, T.L.; Fehlner, T.P.,
The proton as a probe of cluster bonding. The UV photoelectron spectra of two hydrido transition metal clusters,
J. Organomet. Chem., 1981, 215, 48. [all data]