Pyridine, 2-(methylthio)-
- Formula: C6H7NS
- Molecular weight: 125.191
- IUPAC Standard InChIKey: VLQBSKLZRSUMTJ-UHFFFAOYSA-N
- CAS Registry Number: 18438-38-5
- Chemical structure:
View 3d structure (requires JavaScript / HTML 5) - Other names: 2-(Methylthio)pyridine; Methyl 2-pyridyl sulfide; Methylthio-2 pyridine

Reaction thermochemistry data

Data compiled by: Hussein Y. Afeefy, Joel F. Liebman, and Stephen E. Stein
Individual Reactions
By formula: C6H7NS = C6H7NS
Quantity | Value | Units | Method | Reference | Comment |
---|---|---|---|---|---|
ΔrH° | -11. ± 5.4 | kJ/mol | Eqk | Beak and Lee, 1969 | liquid phase; solvent: CDCl3; NMR |

Gas phase ion energetics data

Data evaluated as indicated in comments:
HL - Edward P. Hunter and Sharon G. Lias
Data compiled as indicated in comments:
LLK - Sharon G. Lias, Rhoda D. Levin, and Sherif A. Kafafi
Quantity | Value | Units | Method | Reference | Comment |
---|---|---|---|---|---|
Proton affinity (review) | 937.8 | kJ/mol | N/A | Hunter and Lias, 1998 | HL |
Quantity | Value | Units | Method | Reference | Comment |
Gas basicity | 906.0 | kJ/mol | N/A | Hunter and Lias, 1998 | HL |
Ionization energy determinations
IE (eV) | Method | Reference | Comment |
---|---|---|---|
8.47 ± 0.02 | EI | Gronneberg and Undheim, 1972 | LLK |
8.24 ± 0.03 | PE | Cook, El-Abbady, et al., 1977 | Vertical value; LLK |

References

Beak and Lee, 1969
Beak, P.; Lee, J.T., Jr.,
Equilibration studies. 2-Methylthiopyridine-N-methyl-2-thiopyridone,
J. Org. Chem., 1969, 34, 2125-2128. [all data]
Hunter and Lias, 1998
Hunter, E.P.; Lias, S.G.,
Evaluated Gas Phase Basicities and Proton Affinities of Molecules: An Update,
J. Phys. Chem. Ref. Data, 1998, 27, 3, 413-656, https://doi.org/10.1063/1.556018
. [all data]
Gronneberg and Undheim, 1972
Gronneberg, T.; Undheim, K.,
Mass spectrometry of onium compounds. XI: ionization potentials of hydroxy and mercapto pyridines,
Org. Mass Spectrom., 1972, 6, 823. [all data]
Cook, El-Abbady, et al., 1977
Cook, M.J.; El-Abbady, S.; Katritzky, A.R.; Guimon, C.; Pfister-Guillouzo, G.,
Photoelectron spectra of hydroxy- and mercapto-pyridines and models of fixed structure,
J. Chem. Soc. Perkin Trans. 2, 1977, 1652. [all data]