Silane,(phenylethenylidene)bis[trimethyl-
- Formula: C14H24Si2
- Molecular weight: 248.5114
- IUPAC Standard InChIKey: ULXDRKKYNAWJLU-UHFFFAOYSA-N
- CAS Registry Number: 18415-23-1
- Chemical structure:
View 3d structure (requires JavaScript / HTML 5) - Permanent link for this species. Use this link for bookmarking this species for future reference.

Gas phase ion energetics data

Data compiled by: Sharon G. Lias, Rhoda D. Levin, and Sherif A. Kafafi
Ionization energy determinations
IE (eV) | Method | Reference |
---|---|---|
8.12 ± 0.04 | EI | Benito, Seidl, et al., 1973 |

References

Benito, Seidl, et al., 1973
Benito, I.; Seidl, H.; Bock, H.,
Efectos electronicos y estericos de sustituyentes alquilicos y silicicos sobre el sistema electronico π del estireno,
Rev. Fac. Cienc. Univ. Oviedo, 1973, 14, 95. [all data]