Silane,[1,3-phenylenebis(methylene)]bis[trimethyl-
- Formula: C14H26Si2
- Molecular weight: 250.5272
- IUPAC Standard InChIKey: GIMRYXTWKUXCFR-UHFFFAOYSA-N
- CAS Registry Number: 18412-15-2
- Chemical structure:
View 3d structure (requires JavaScript / HTML 5) - Permanent link for this species. Use this link for bookmarking this species for future reference.

Gas phase ion energetics data

Data compiled by: Sharon G. Lias, Rhoda D. Levin, and Sherif A. Kafafi
Ionization energy determinations
IE (eV) | Method | Reference | Comment |
---|---|---|---|
8.05 | PE | Bock and Kaim, 1978 | Vertical value |
8.10 | PE | Bock, Kaim, et al., 1977 | Vertical value |

References

Bock and Kaim, 1978
Bock, H.; Kaim, W.,
Einelektronen-Oxidationen (H3C)3SiCH2-substituierter Benzole in der Gasphase und in Losung,
Chem. Ber., 1978, 111, 3552. [all data]
Bock, Kaim, et al., 1977
Bock, H.; Kaim, W.; Rohwer, H.E.,
Radical ions XI*. One-electron oxidation of alkylsilyl benzenes in the gas phase and in solution,
J. Organomet. Chem., 1977, 135, 14. [all data]