Silane,trimethyl(1-naphthalenylmethyl)-
- Formula: C14H18Si
- Molecular weight: 214.3782
- IUPAC Standard InChIKey: ZDVDCWGJCRZBHK-UHFFFAOYSA-N
- CAS Registry Number: 18410-58-7
- Chemical structure:
View 3d structure (requires JavaScript / HTML 5) - Permanent link for this species. Use this link for bookmarking this species for future reference.

Gas phase ion energetics data

Data compiled by: Sharon G. Lias, Rhoda D. Levin, and Sherif A. Kafafi
Ionization energy determinations
IE (eV) | Method | Reference |
---|---|---|
7.83 | CTS | Pitt, 1973 |
7.83 | CTS | Pitt, Carey, et al., 1972 |

References

Pitt, 1973
Pitt, C.G.,
Hyperconjugation and its role in group IV chemistry,
J. Organomet. Chem., 1973, 61, 49. [all data]
Pitt, Carey, et al., 1972
Pitt, C.G.; Carey, R.N.; Toren, E.C.,
Nature of the electronic interactions in aryl-substituted polysilanes,
J. Am. Chem. Soc., 1972, 94, 3806. [all data]